Loading

Paste #pl3pqzcke

  1. diff --git a/libphobos/libdruntime/gcc/gthreads/posix.d b/libphobos/libdruntime/gcc/gthreads/posix.d
  2. index 15714dd..cc357f9 100644
  3. --- a/libphobos/libdruntime/gcc/gthreads/posix.d
  4. +++ b/libphobos/libdruntime/gcc/gthreads/posix.d
  5. @@ -24,7 +24,44 @@ module gcc.gthreads.posix;

6th one gives an error

  1. *** Error during phase configure of atk: ########## Error running ./autogen.sh --prefix /home/abhinav/jhbuild/install --disable-Werror  --disable-static --disable-gtk-doc  *** [6/52]
  2.  
  3.   [1] Rerun phase configure
  4.   [2] Ignore error and continue to build
  5.   [3] Give up on module

task2.asm

  1. .model tiny
  2. .486
  3. .data
  4. str1 db "Enter User Name", 0dh, 0ah, "$"
  5. ucnt db 10

goa warning

  1. ➜  ~ jhbuild run gnome-control-center        
  2. Gtk-Message: Failed to load module "canberra-gtk-module"
  3. Gtk-Message: Failed to load module "canberra-gtk-module"
  4.  
  5. (gnome-control-center:8129): Goa-WARNING **: Error setting property 'MusicDisabled' on interface org.gnome.OnlineAccounts.Account: GDBus.Error:org.freedesktop.DBus.Error.InvalidArgs: No such property 'MusicDisabled' (g-dbus-error-quark, 16)

jhbuild sanitycheck

  1. automake error
  2.  
  3. I have automake installed with version 1.15.
  4. It shows no automake >= 1.10 found

Paste #p3yrhgkcu

  1. (gnome-maps:10756): Gtk-WARNING **: gtkliststore.c:836: Unable to convert from gpointer to gchararray
  2.  
  3.  
  4. (gnome-maps:10756): Gjs-WARNING **: JS ERROR: TypeError: this._place[this._titleProperty] is null
  5. PlaceFormatter<.title@resource:///org/gnome/Maps/js/placeFormatter.js:48

Missing events

  1. #include <gtk/gtk.h>
  2. #include <clutter-gtk/clutter-gtk.h>
  3.  
  4. gboolean
  5. clutter_stage_event_cb (ClutterStage *stage,

Paste #pzg4zgvyu

  1. Feb 07 19:47:22 <Gamebag>   Damn you linux
  2. Feb 07 19:47:33 <Shadowhand>    You on IRSSI?=
  3. Feb 07 19:47:36 <zowlyfon>  why did medfly go?
  4. Feb 07 19:47:38 <Gamebag>   weechat
  5. Feb 07 19:47:44 <Gamebag>   irssi wouldn't msg

0001-fix-path-find.patch

  1. --- a/lib/mate-menu.py
  2. +++ b/lib/mate-menu.py
  3. @@ -73,19 +73,6 @@ xdg.Config.setWindowManager('MATE')
  4.  
  5.  from mate_menu.execute import *

eRROR2 Gnome builder

  1. Makefile:733: recipe for target 'libgit_plugin_la-ide-git-remote-callbacks.lo' failed
  2. make[3]: *** [libgit_plugin_la-ide-git-remote-callbacks.lo] Error 1
  3. make[3]: Leaving directory '/home/ayush/jhbuild/checkout/gnome-builder/plugins/git'
  4. Makefile:872: recipe for target 'install' failed
  5. make[2]: *** [install] Error 2

Error installing gnome-bu

  1. *** Checking out gnome-builder *** [1/1]
  2. git remote set-url origin git://git.gnome.org/gnome-builder
  3. git remote update origin
  4. Fetching origin
  5. git rebase origin/master

Paste #p1vmrvwvx

  1. using UnityEngine;
  2. using System.Collections;
  3.  
  4. public class Mover : MonoBehaviour
  5. {

Paste #pparg5xzv

  1. <levels>
  2.     <level id="lake_grass">
  3.         <quest id ="1" action="pickupItem" target="20x0" itemvalue="5" entvalue="1">
  4.             <description>
  5.             Pickup the hay

Paste #pxhdgoyax

  1. //header
  2.  
  3. #pragma once

Paste #pxka8kwia

  1.     struct entity {
  2.         int id;
  3.         sf::Sprite Sprite;
  4.         sf::Texture Tex;
  5.         std::string texPath;