Loading

Revision differences

Old revision #pphrf5bihNew revision #peztjkb0g
1➜  gstreamer-sys git:(master) cargo test -p gstreamer-gl-sys  1➜  gstreamer-sys git:(master) cargo test -p gstreamer-gl-sys  
2    Finished dev [unoptimized + debuginfo] target(s) in 0.07s                                               2    Finished dev [unoptimized + debuginfo] target(s) in 0.07s                                               
3     Running target/debug/deps/gstreamer_gl_sys-aeb5b79ba1f46775  3     Running target/debug/deps/gstreamer_gl_sys-aeb5b79ba1f46775  
4    
5running 0 tests    
6    
7test result: ok. 0 passed; 0 failed; 0 ignored; 0 measured; 0 filtered out    
8    
9     Running target/debug/deps/abi-faa3697187d6ca1b    
10  4  
11running 2 tests  5running 2 tests  
12test cross_validate_layout_with_c ... ok  6test cross_validate_layout_with_c ... ok  
  
24failures:  18failures:  
25  19  
26---- cross_validate_constants_with_c stdout ----  20---- cross_validate_constants_with_c stdout ----  
27constants ... 25 passed; 0 failed (compilation errors: 0)    
28constants ... 50 passed; 0 failed (compilation errors: 0)    
29compilation command "cc" "-Wno-deprecated-declarations" "-D__USE_MINGW_ANSI_STDIO" "-I/usr/include/gstreamer-1.0" "-I/usr/lib64/gstreamer-1.0/include" "-I/usr/include/libdrm" "-I/usr/include/glib-2.0" "-I/usr/lib64/glib-2.0/include" "-I/usr/include/orc-0.4" "-pthread" "-DABI_CONSTANT_NAME=GST_GL_DISPLAY_EGL_NAME" "tests/constant.c" "-o" "/tmp/abi.ZiOovvEwTtUi/constant" failed, exit code: 1  21compilation command "cc" "-Wno-deprecated-declarations" "-D__USE_MINGW_ANSI_STDIO" "-I/usr/include/gstreamer-1.0" "-I/usr/lib64/gstreamer-1.0/include" "-I/usr/include/libdrm" "-I/usr/include/glib-2.0" "-I/usr/lib64/glib-2.0/include" "-I/usr/include/orc-0.4" "-pthread" "-DABI_CONSTANT_NAME=GST_GL_DISPLAY_EGL_NAME" "tests/constant.c" "-o" "/tmp/abi.ZiOovvEwTtUi/constant" failed, exit code: 1  
30constants ... 73 passed; 2 failed (compilation errors: 1)    
31constants ... 98 passed; 2 failed (compilation errors: 1)    
32constants ... 123 passed; 2 failed (compilation errors: 1)    
33thread 'cross_validate_constants_with_c' panicked at 'FAILED: 123 passed; 2 failed (compilation errors: 1)', gstreamer-gl-sys/tests/abi.rs:126:13    
34note: Run with `RUST_BACKTRACE=1` for a backtrace.    
35  22  
36  23  
37failures:  24failures:  
38    cross_validate_constants_with_c  25    cross_validate_constants_with_c  
39  26  
40test result: FAILED. 1 passed; 1 failed; 0 ignored; 0 measured; 0 filtered out    
41    
42error: test failed, to rerun pass '-p gstreamer-gl-sys --test abi' 27error: test failed, to rerun pass '-p gstreamer-gl-sys --test abi'