Loading

gpseq

  1. gavr@gavr-VirtualBox:~/Tests/gpseq-master$ ninja -C build
  2. ninja: Entering directory `build'
  3. [1/87] Compiling Vala source ../src/Ar...src/collectors/SumUlongCollector.vala.
  4. FAILED: src/25a6634@@gpseq-0.1@sha/ArrayBuffer.c src/25a6634@@gpseq-0.1@sha/ArrayBufferSpliterator.c src/25a6634@@gpseq-0.1@sha/ArraySpliterator.c src/25a6634@@gpseq-0.1@sha/AtomicBoolRef.c src/25a6634@@gpseq-0.1@sha/AtomicIntRef.c src/25a6634@@gpseq-0.1@sha/AtomicObjectRef.c src/25a6634@@gpseq-0.1@sha/CollectTask.c src/25a6634@@gpseq-0.1@sha/Collector.c src/25a6634@@gpseq-0.1@sha/CollectorFeatures.c src/25a6634@@gpseq-0.1@sha/Collectors.c src/25a6634@@gpseq-0.1@sha/CombineFunc.c src/25a6634@@gpseq-0.1@sha/Comparator.c src/25a6634@@gpseq-0.1@sha/ConcatArrayBuffer.c src/25a6634@@gpseq-0.1@sha/Consumer.c src/25a6634@@gpseq-0.1@sha/Container.c src/25a6634@@gpseq-0.1@sha/DefaultContainer.c src/25a6634@@gpseq-0.1@sha/DefaultQueueBalancer.c src/25a6634@@gpseq-0.1@sha/DefaultSupplier.c src/25a6634@@gpseq-0.1@sha/DefaultTaskEnv.c src/25a6634@@gpseq-0.1@sha/DistinctContainer.c src/25a6634@@gpseq-0.1@sha/EachChunkFunc.c src/25a6634@@gpseq-0.1@sha/EmptySpliterator.c src/25a6634@@gpseq-0.1@sha/Executor.c src/25a6634@@gpseq-0.1@sha/FilteredContainer.c src/25a6634@@gpseq-0.1@sha/FindTask.c src/25a6634@@gpseq-0.1@sha/FlatMappedContainer.c src/25a6634@@gpseq-0.1@sha/FoldTask.c src/25a6634@@gpseq-0.1@sha/ForEachTask.c src/25a6634@@gpseq-0.1@sha/ForkJoinPool.c src/25a6634@@gpseq-0.1@sha/ForkJoinTask.c src/25a6634@@gpseq-0.1@sha/ForkJoinThread.c src/25a6634@@gpseq-0.1@sha/GenericArraySpliterator.c src/25a6634@@gpseq-0.1@sha/Gpseq.c src/25a6634@@gpseq-0.1@sha/IteratorSpliterator.c src/25a6634@@gpseq-0.1@sha/ListSpliterator.c src/25a6634@@gpseq-0.1@sha/MappedContainer.c src/25a6634@@gpseq-0.1@sha/MatchTask.c src/25a6634@@gpseq-0.1@sha/Optional.c src/25a6634@@gpseq-0.1@sha/OptionalError.c src/25a6634@@gpseq-0.1@sha/OrderedSliceTask.c src/25a6634@@gpseq-0.1@sha/QueueBalancer.c src/25a6634@@gpseq-0.1@sha/ReduceTask.c src/25a6634@@gpseq-0.1@sha/ResultIterator.c src/25a6634@@gpseq-0.1@sha/ResultSpliterator.c src/25a6634@@gpseq-0.1@sha/Seq.c src/25a6634@@gpseq-0.1@sha/SequentialSliceSpliterator.c src/25a6634@@gpseq-0.1@sha/ShortCircuitTask.c src/25a6634@@gpseq-0.1@sha/SliceContainer.c src/25a6634@@gpseq-0.1@sha/SortTask.c src/25a6634@@gpseq-0.1@sha/SortedContainer.c src/25a6634@@gpseq-0.1@sha/Spliterator.c src/25a6634@@gpseq-0.1@sha/SubArray.c src/25a6634@@gpseq-0.1@sha/SubArraySpliterator.c src/25a6634@@gpseq-0.1@sha/Supplier.c src/25a6634@@gpseq-0.1@sha/SupplierSpliterator.c src/25a6634@@gpseq-0.1@sha/SupplyFunc.c src/25a6634@@gpseq-0.1@sha/TaskEnv.c src/25a6634@@gpseq-0.1@sha/ThreadFactory.c src/25a6634@@gpseq-0.1@sha/TimSort.c src/25a6634@@gpseq-0.1@sha/UnorderedSliceSpliterator.c src/25a6634@@gpseq-0.1@sha/WorkQueue.c src/25a6634@@gpseq-0.1@sha/collectors/ConcurrentListCollector.c src/25a6634@@gpseq-0.1@sha/collectors/GenericArrayCollector.c src/25a6634@@gpseq-0.1@sha/collectors/ListCollector.c src/25a6634@@gpseq-0.1@sha/collectors/SumInt32Collector.c src/25a6634@@gpseq-0.1@sha/collectors/SumInt64Collector.c src/25a6634@@gpseq-0.1@sha/collectors/SumIntCollector.c src/25a6634@@gpseq-0.1@sha/collectors/SumLongCollector.c src/25a6634@@gpseq-0.1@sha/collectors/SumUint32Collector.c src/25a6634@@gpseq-0.1@sha/collectors/SumUint64Collector.c src/25a6634@@gpseq-0.1@sha/collectors/SumUintCollector.c src/25a6634@@gpseq-0.1@sha/collectors/SumUlongCollector.c src/gpseq.h src/gpseq-0.1.vapi src/gpseq-0.1.gir
  5. valac -C --debug --pkg gee-0.8 --pkg gobject-2.0 --target-glib 2.36 --pkg glib-2.0 --color=always --directory src/25a6634@@gpseq-0.1@sha --basedir ../src --library gpseq-0.1 --header src/gpseq.h --vapi ../gpseq-0.1.vapi --gir ../gpseq-0.1.gir --target-glib=2.36 --enable-experimental --verbose --thread ../src/ArrayBuffer.vala ../src/ArrayBufferSpliterator.vala ../src/ArraySpliterator.vala ../src/AtomicBoolRef.vala ../src/AtomicIntRef.vala ../src/AtomicObjectRef.vala ../src/CollectTask.vala ../src/Collector.vala ../src/CollectorFeatures.vala ../src/Collectors.vala ../src/CombineFunc.vala ../src/Comparator.vala ../src/ConcatArrayBuffer.vala ../src/Consumer.vala ../src/Container.vala ../src/DefaultContainer.vala ../src/DefaultQueueBalancer.vala ../src/DefaultSupplier.vala ../src/DefaultTaskEnv.vala ../src/DistinctContainer.vala ../src/EachChunkFunc.vala ../src/EmptySpliterator.vala ../src/Executor.vala ../src/FilteredContainer.vala ../src/FindTask.vala ../src/FlatMappedContainer.vala ../src/FoldTask.vala ../src/ForEachTask.vala ../src/ForkJoinPool.vala ../src/ForkJoinTask.vala ../src/ForkJoinThread.vala ../src/GenericArraySpliterator.vala ../src/Gpseq.vala ../src/IteratorSpliterator.vala ../src/ListSpliterator.vala ../src/MappedContainer.vala ../src/MatchTask.vala ../src/Optional.vala ../src/OptionalError.vala ../src/OrderedSliceTask.vala ../src/QueueBalancer.vala ../src/ReduceTask.vala ../src/ResultIterator.vala ../src/ResultSpliterator.vala ../src/Seq.vala ../src/SequentialSliceSpliterator.vala ../src/ShortCircuitTask.vala ../src/SliceContainer.vala ../src/SortTask.vala ../src/SortedContainer.vala ../src/Spliterator.vala ../src/SubArray.vala ../src/SubArraySpliterator.vala ../src/Supplier.vala ../src/SupplierSpliterator.vala ../src/SupplyFunc.vala ../src/TaskEnv.vala ../src/ThreadFactory.vala ../src/TimSort.vala ../src/UnorderedSliceSpliterator.vala ../src/WorkQueue.vala ../src/collectors/ConcurrentListCollector.vala ../src/collectors/GenericArrayCollector.vala ../src/collectors/ListCollector.vala ../src/collectors/SumInt32Collector.vala ../src/collectors/SumInt64Collector.vala ../src/collectors/SumIntCollector.vala ../src/collectors/SumLongCollector.vala ../src/collectors/SumUint32Collector.vala ../src/collectors/SumUint64Collector.vala ../src/collectors/SumUintCollector.vala ../src/collectors/SumUlongCollector.vala
  6. ../src/ArrayBufferSpliterator.vala:26.11-26.24: error: The type name `ArrayBuffer' could not be found
  7.         private ArrayBuffer<G> _array;
  8.                 ^^^^^^^^^^^^^^
  9. ../src/ArrayBufferSpliterator.vala:36.34-36.47: error: The type name `ArrayBuffer' could not be found
  10.         public ArrayBufferSpliterator (ArrayBuffer<G> array, int start, int stop) {
  11.                                        ^^^^^^^^^^^^^^
  12. ../src/ConcatArrayBuffer.vala:27.40-27.53: error: The type name `ArrayBuffer' could not be found
  13.     internal class ConcatArrayBuffer<G> : ArrayBuffer<G> {
  14.                                           ^^^^^^^^^^^^^^
  15. ../src/ConcatArrayBuffer.vala:28.11-28.24: error: The type name `ArrayBuffer' could not be found
  16.         private ArrayBuffer<G> _left;
  17.                 ^^^^^^^^^^^^^^
  18. ../src/ConcatArrayBuffer.vala:29.11-29.24: error: The type name `ArrayBuffer' could not be found
  19.         private ArrayBuffer<G> _right;
  20.                 ^^^^^^^^^^^^^^
  21. ../src/ConcatArrayBuffer.vala:36.29-36.42: error: The type name `ArrayBuffer' could not be found
  22.         public ConcatArrayBuffer (ArrayBuffer<G> left, ArrayBuffer<G> right) {
  23.                                   ^^^^^^^^^^^^^^
  24. ../src/ConcatArrayBuffer.vala:36.50-36.63: error: The type name `ArrayBuffer' could not be found
  25.         public ConcatArrayBuffer (ArrayBuffer<G> left, ArrayBuffer<G> right) {
  26.                                                        ^^^^^^^^^^^^^^
  27. ../src/ConcatArrayBuffer.vala:81.19-81.32: error: The type name `ArrayBuffer' could not be found
  28.         public override ArrayBuffer<G> slice (int start, int stop) {
  29.                         ^^^^^^^^^^^^^^
  30. ../src/ConcatArrayBuffer.vala:89.5-89.18: error: The type name `ArrayBuffer' could not be found
  31.                 ArrayBuffer<G> left = _left.slice(start, size_l);
  32.                 ^^^^^^^^^^^^^^
  33. ../src/ConcatArrayBuffer.vala:90.5-90.18: error: The type name `ArrayBuffer' could not be found
  34.                 ArrayBuffer<G> right = _right.slice(0, stop - size_l);
  35.                 ^^^^^^^^^^^^^^
  36. ../src/OrderedSliceTask.vala:27.58-27.71: error: The type name `ArrayBuffer' could not be found
  37.     internal class OrderedSliceTask<G> : ShortCircuitTask<G,ArrayBuffer<G>> {
  38.                                                             ^^^^^^^^^^^^^^
  39. ../src/OrderedSliceTask.vala:63.31-63.44: error: The type name `ArrayBuffer' could not be found
  40.         protected override Optional<ArrayBuffer<G>> leaf_compute () {
  41.                                     ^^^^^^^^^^^^^^
  42. ../src/OrderedSliceTask.vala:65.4-65.17: error: The type name `ArrayBuffer' could not be found
  43.             ArrayBuffer<G> buffer = new ArrayBuffer<G>((owned) array);
  44.             ^^^^^^^^^^^^^^
  45. ../src/OrderedSliceTask.vala:68.31-68.44: error: The type name `ArrayBuffer' could not be found
  46.                 var result = new Optional<ArrayBuffer<G>>.of(buffer);
  47.                                           ^^^^^^^^^^^^^^
  48. ../src/OrderedSliceTask.vala:75.25-75.38: error: The type name `ArrayBuffer' could not be found
  49.                 return new Optional<ArrayBuffer<G>>.of(buffer);
  50.                                     ^^^^^^^^^^^^^^
  51. ../src/OrderedSliceTask.vala:79.31-79.44: error: The type name `ArrayBuffer' could not be found
  52.         protected override Optional<ArrayBuffer<G>> merge_results (
  53.                                     ^^^^^^^^^^^^^^
  54. ../src/OrderedSliceTask.vala:80.14-80.27: error: The type name `ArrayBuffer' could not be found
  55.                 Optional<ArrayBuffer<G>> left, Optional<ArrayBuffer<G>> right) {
  56.                          ^^^^^^^^^^^^^^
  57. ../src/OrderedSliceTask.vala:80.45-80.58: error: The type name `ArrayBuffer' could not be found
  58.                 Optional<ArrayBuffer<G>> left, Optional<ArrayBuffer<G>> right) {
  59.                                                         ^^^^^^^^^^^^^^
  60. ../src/OrderedSliceTask.vala:81.4-81.17: error: The type name `ArrayBuffer' could not be found
  61.             ArrayBuffer<G> array;
  62.             ^^^^^^^^^^^^^^
  63. ../src/OrderedSliceTask.vala:96.31-96.44: error: The type name `ArrayBuffer' could not be found
  64.                 var result = new Optional<ArrayBuffer<G>>.of(array);
  65.                                           ^^^^^^^^^^^^^^
  66. ../src/OrderedSliceTask.vala:102.25-102.38: error: The type name `ArrayBuffer' could not be found
  67.                 return new Optional<ArrayBuffer<G>>.of(array);
  68.                                     ^^^^^^^^^^^^^^
  69. ../src/OrderedSliceTask.vala:106.41-106.54: error: The type name `ArrayBuffer' could not be found
  70.         protected override ShortCircuitTask<G,ArrayBuffer<G>> make_child (Spliterator<G> spliterator) {
  71.                                               ^^^^^^^^^^^^^^
  72. ../src/OrderedSliceTask.vala:170.11-170.24: error: The type name `ArrayBuffer' could not be found
  73.         private ArrayBuffer<G> chop (ArrayBuffer<G> array) {
  74.                 ^^^^^^^^^^^^^^
  75. ../src/OrderedSliceTask.vala:170.32-170.45: error: The type name `ArrayBuffer' could not be found
  76.         private ArrayBuffer<G> chop (ArrayBuffer<G> array) {
  77.                                      ^^^^^^^^^^^^^^
  78. ../src/OrderedSliceTask.vala:57.31-57.44: error: The type name `ArrayBuffer' could not be found
  79.         protected override Optional<ArrayBuffer<G>> empty_result {
  80.                                     ^^^^^^^^^^^^^^
  81. ../src/OrderedSliceTask.vala:57.31-57.44: error: The type name `ArrayBuffer' could not be found
  82.         protected override Optional<ArrayBuffer<G>> empty_result {
  83.                                     ^^^^^^^^^^^^^^
  84. ../src/OrderedSliceTask.vala:59.25-59.38: error: The type name `ArrayBuffer' could not be found
  85.                 return new Optional<ArrayBuffer<G>>.of( new ArrayBuffer<G>({}) );
  86.                                     ^^^^^^^^^^^^^^
  87. ../src/SliceContainer.vala:79.5-79.18: error: The type name `ArrayBuffer' could not be found
  88.                 ArrayBuffer<G> result = task.shared_result.value;
  89.                 ^^^^^^^^^^^^^^
  90. Command-line option `--thread` is deprecated and will be ignored
  91. Loaded package `/usr/share/vala-0.44/vapi/glib-2.0.vapi'
  92. Loaded package `/usr/share/vala-0.44/vapi/gobject-2.0.vapi'
  93. Loaded package `/usr/share/vala/vapi/gee-0.8.vapi'
  94. Compilation failed: 28 error(s), 0 warning(s)
  95. ninja: build stopped: subcommand failed.