Loading

Paste #pqyvj0v8y

  1.                             ^~~~~~~~
  2. In file included from /run/build/opencolorio/_flatpak_build/ext/yaml-cpp/src/node.cpp:4:
  3. /run/build/opencolorio/_flatpak_build/ext/yaml-cpp/include/yaml-cpp/emitter.h:105:8: warning: ‘template<class> class std::auto_ptr’ is deprecated [-Wdeprecated-declarations]
  4.    std::auto_ptr <EmitterState> m_pState;
  5.         ^~~~~~~~
  6. In file included from /usr/include/c++/8.3.0/memory:80,
  7.                  from /run/build/opencolorio/_flatpak_build/ext/yaml-cpp/include/yaml-cpp/iterator.h:9,
  8.                  from /run/build/opencolorio/_flatpak_build/ext/yaml-cpp/include/yaml-cpp/node.h:14,
  9.                  from /run/build/opencolorio/_flatpak_build/ext/yaml-cpp/src/node.cpp:1:
  10. /usr/include/c++/8.3.0/bits/unique_ptr.h:53:28: note: declared here
  11.    template<typename> class auto_ptr;
  12.                             ^~~~~~~~
  13. In file included from /run/build/opencolorio/_flatpak_build/ext/yaml-cpp/src/nodeownership.h:10,
  14.                  from /run/build/opencolorio/_flatpak_build/ext/yaml-cpp/src/node.cpp:8:
  15. /run/build/opencolorio/_flatpak_build/ext/yaml-cpp/src/ptr_vector.h:32:23: warning: ‘template<class> class std::auto_ptr’ is deprecated [-Wdeprecated-declarations]
  16.    void push_back(std::auto_ptr<T> t) {
  17.                        ^~~~~~~~
  18. In file included from /usr/include/c++/8.3.0/memory:80,
  19.                  from /run/build/opencolorio/_flatpak_build/ext/yaml-cpp/include/yaml-cpp/iterator.h:9,
  20.                  from /run/build/opencolorio/_flatpak_build/ext/yaml-cpp/include/yaml-cpp/node.h:14,
  21.                  from /run/build/opencolorio/_flatpak_build/ext/yaml-cpp/src/node.cpp:1:
  22. /usr/include/c++/8.3.0/bits/unique_ptr.h:53:28: note: declared here
  23.    template<typename> class auto_ptr;
  24.                             ^~~~~~~~
  25. /run/build/opencolorio/_flatpak_build/ext/yaml-cpp/src/node.cpp:54:7: warning: ‘template<class> class std::auto_ptr’ is deprecated [-Wdeprecated-declarations]
  26.   std::auto_ptr<Node> Node::Clone() const
  27.        ^~~~~~~~
  28. In file included from /usr/include/c++/8.3.0/memory:80,
  29.                  from /run/build/opencolorio/_flatpak_build/ext/yaml-cpp/include/yaml-cpp/iterator.h:9,
  30.                  from /run/build/opencolorio/_flatpak_build/ext/yaml-cpp/include/yaml-cpp/node.h:14,
  31.                  from /run/build/opencolorio/_flatpak_build/ext/yaml-cpp/src/node.cpp:1:
  32. /usr/include/c++/8.3.0/bits/unique_ptr.h:53:28: note: declared here
  33.    template<typename> class auto_ptr;
  34.                             ^~~~~~~~
  35. /run/build/opencolorio/_flatpak_build/ext/yaml-cpp/src/node.cpp: In member function ‘std::auto_ptr<YAML::Node> YAML::Node::Clone() const’:
  36. /run/build/opencolorio/_flatpak_build/ext/yaml-cpp/src/node.cpp:56:8: warning: ‘template<class> class std::auto_ptr’ is deprecated [-Wdeprecated-declarations]
  37.    std::auto_ptr<Node> pNode(new Node);
  38.         ^~~~~~~~
  39. In file included from /usr/include/c++/8.3.0/memory:80,
  40.                  from /run/build/opencolorio/_flatpak_build/ext/yaml-cpp/include/yaml-cpp/iterator.h:9,
  41.                  from /run/build/opencolorio/_flatpak_build/ext/yaml-cpp/include/yaml-cpp/node.h:14,
  42.                  from /run/build/opencolorio/_flatpak_build/ext/yaml-cpp/src/node.cpp:1:
  43. /usr/include/c++/8.3.0/bits/unique_ptr.h:53:28: note: declared here
  44.    template<typename> class auto_ptr;
  45.                             ^~~~~~~~
  46. /run/build/opencolorio/_flatpak_build/ext/yaml-cpp/src/node.cpp: In member function ‘YAML::Iterator YAML::Node::begin() const’:
  47. /run/build/opencolorio/_flatpak_build/ext/yaml-cpp/src/node.cpp:148:26: warning: ‘template<class> class std::auto_ptr’ is deprecated [-Wdeprecated-declarations]
  48.      return Iterator(std::auto_ptr<IterPriv>(new IterPriv(m_seqData.begin())));
  49.                           ^~~~~~~~
  50. In file included from /usr/include/c++/8.3.0/memory:80,
  51.                  from /run/build/opencolorio/_flatpak_build/ext/yaml-cpp/include/yaml-cpp/iterator.h:9,
  52.                  from /run/build/opencolorio/_flatpak_build/ext/yaml-cpp/include/yaml-cpp/node.h:14,
  53.                  from /run/build/opencolorio/_flatpak_build/ext/yaml-cpp/src/node.cpp:1:
  54. /usr/include/c++/8.3.0/bits/unique_ptr.h:53:28: note: declared here
  55.    template<typename> class auto_ptr;
  56.                             ^~~~~~~~
  57. /run/build/opencolorio/_flatpak_build/ext/yaml-cpp/src/node.cpp:150:26: warning: ‘template<class> class std::auto_ptr’ is deprecated [-Wdeprecated-declarations]
  58.      return Iterator(std::auto_ptr<IterPriv>(new IterPriv(m_mapData.begin())));
  59.                           ^~~~~~~~
  60. In file included from /usr/include/c++/8.3.0/memory:80,
  61.                  from /run/build/opencolorio/_flatpak_build/ext/yaml-cpp/include/yaml-cpp/iterator.h:9,
  62.                  from /run/build/opencolorio/_flatpak_build/ext/yaml-cpp/include/yaml-cpp/node.h:14,
  63.                  from /run/build/opencolorio/_flatpak_build/ext/yaml-cpp/src/node.cpp:1:
  64. /usr/include/c++/8.3.0/bits/unique_ptr.h:53:28: note: declared here
  65.    template<typename> class auto_ptr;
  66.                             ^~~~~~~~
  67. /run/build/opencolorio/_flatpak_build/ext/yaml-cpp/src/node.cpp: In member function ‘YAML::Iterator YAML::Node::end() const’:
  68. /run/build/opencolorio/_flatpak_build/ext/yaml-cpp/src/node.cpp:166:26: warning: ‘template<class> class std::auto_ptr’ is deprecated [-Wdeprecated-declarations]
  69.      return Iterator(std::auto_ptr<IterPriv>(new IterPriv(m_seqData.end())));
  70.                           ^~~~~~~~
  71. In file included from /usr/include/c++/8.3.0/memory:80,
  72.                  from /run/build/opencolorio/_flatpak_build/ext/yaml-cpp/include/yaml-cpp/iterator.h:9,
  73.                  from /run/build/opencolorio/_flatpak_build/ext/yaml-cpp/include/yaml-cpp/node.h:14,
  74.                  from /run/build/opencolorio/_flatpak_build/ext/yaml-cpp/src/node.cpp:1:
  75. /usr/include/c++/8.3.0/bits/unique_ptr.h:53:28: note: declared here
  76.    template<typename> class auto_ptr;
  77.                             ^~~~~~~~
  78. /run/build/opencolorio/_flatpak_build/ext/yaml-cpp/src/node.cpp:168:26: warning: ‘template<class> class std::auto_ptr’ is deprecated [-Wdeprecated-declarations]
  79.      return Iterator(std::auto_ptr<IterPriv>(new IterPriv(m_mapData.end())));
  80.                           ^~~~~~~~
  81. In file included from /usr/include/c++/8.3.0/memory:80,
  82.                  from /run/build/opencolorio/_flatpak_build/ext/yaml-cpp/include/yaml-cpp/iterator.h:9,
  83.                  from /run/build/opencolorio/_flatpak_build/ext/yaml-cpp/include/yaml-cpp/node.h:14,
  84.                  from /run/build/opencolorio/_flatpak_build/ext/yaml-cpp/src/node.cpp:1:
  85. /usr/include/c++/8.3.0/bits/unique_ptr.h:53:28: note: declared here
  86.    template<typename> class auto_ptr;
  87.                             ^~~~~~~~
  88. [ 53%] Building CXX object CMakeFiles/yaml-cpp.dir/src/ostream.cpp.o
  89. In file included from /run/build/opencolorio/_flatpak_build/ext/yaml-cpp/src/nodeownership.h:10,
  90.                  from /run/build/opencolorio/_flatpak_build/ext/yaml-cpp/src/nodeownership.cpp:1:
  91. /run/build/opencolorio/_flatpak_build/ext/yaml-cpp/src/ptr_vector.h:32:23: warning: ‘template<class> class std::auto_ptr’ is deprecated [-Wdeprecated-declarations]
  92.    void push_back(std::auto_ptr<T> t) {
  93.                        ^~~~~~~~
  94. In file included from /usr/include/c++/8.3.0/memory:80,
  95.                  from /run/build/opencolorio/_flatpak_build/ext/yaml-cpp/src/ptr_vector.h:11,
  96.                  from /run/build/opencolorio/_flatpak_build/ext/yaml-cpp/src/nodeownership.h:10,
  97.                  from /run/build/opencolorio/_flatpak_build/ext/yaml-cpp/src/nodeownership.cpp:1:
  98. /usr/include/c++/8.3.0/bits/unique_ptr.h:53:28: note: declared here
  99.    template<typename> class auto_ptr;
  100.                             ^~~~~~~~
  101. In file included from /run/build/opencolorio/_flatpak_build/ext/yaml-cpp/include/yaml-cpp/node.h:14,
  102.                  from /run/build/opencolorio/_flatpak_build/ext/yaml-cpp/src/nodeownership.cpp:2:
  103. /run/build/opencolorio/_flatpak_build/ext/yaml-cpp/include/yaml-cpp/iterator.h:20:17: warning: ‘template<class> class std::auto_ptr’ is deprecated [-Wdeprecated-declarations]
  104.    Iterator(std::auto_ptr<IterPriv> pData);
  105.                  ^~~~~~~~
  106. In file included from /usr/include/c++/8.3.0/memory:80,
  107.                  from /run/build/opencolorio/_flatpak_build/ext/yaml-cpp/src/ptr_vector.h:11,
  108.                  from /run/build/opencolorio/_flatpak_build/ext/yaml-cpp/src/nodeownership.h:10,
  109.                  from /run/build/opencolorio/_flatpak_build/ext/yaml-cpp/src/nodeownership.cpp:1:
  110. /usr/include/c++/8.3.0/bits/unique_ptr.h:53:28: note: declared here
  111.    template<typename> class auto_ptr;
  112.                             ^~~~~~~~
  113. In file included from /run/build/opencolorio/_flatpak_build/ext/yaml-cpp/include/yaml-cpp/node.h:14,
  114.                  from /run/build/opencolorio/_flatpak_build/ext/yaml-cpp/src/nodeownership.cpp:2:
  115. /run/build/opencolorio/_flatpak_build/ext/yaml-cpp/include/yaml-cpp/iterator.h:36:8: warning: ‘template<class> class std::auto_ptr’ is deprecated [-Wdeprecated-declarations]
  116.    std::auto_ptr<IterPriv> m_pData;
  117.         ^~~~~~~~
  118. In file included from /usr/include/c++/8.3.0/memory:80,
  119.                  from /run/build/opencolorio/_flatpak_build/ext/yaml-cpp/src/ptr_vector.h:11,
  120.                  from /run/build/opencolorio/_flatpak_build/ext/yaml-cpp/src/nodeownership.h:10,
  121.                  from /run/build/opencolorio/_flatpak_build/ext/yaml-cpp/src/nodeownership.cpp:1:
  122. /usr/include/c++/8.3.0/bits/unique_ptr.h:53:28: note: declared here
  123.    template<typename> class auto_ptr;
  124.                             ^~~~~~~~
  125. In file included from /run/build/opencolorio/_flatpak_build/ext/yaml-cpp/src/nodeownership.cpp:2:
  126. /run/build/opencolorio/_flatpak_build/ext/yaml-cpp/include/yaml-cpp/node.h:43:8: warning: ‘template<class> class std::auto_ptr’ is deprecated [-Wdeprecated-declarations]
  127.    std::auto_ptr<Node> Clone() const;
  128.         ^~~~~~~~
  129. In file included from /usr/include/c++/8.3.0/memory:80,
  130.                  from /run/build/opencolorio/_flatpak_build/ext/yaml-cpp/src/ptr_vector.h:11,
  131.                  from /run/build/opencolorio/_flatpak_build/ext/yaml-cpp/src/nodeownership.h:10,
  132.                  from /run/build/opencolorio/_flatpak_build/ext/yaml-cpp/src/nodeownership.cpp:1:
  133. /usr/include/c++/8.3.0/bits/unique_ptr.h:53:28: note: declared here
  134.    template<typename> class auto_ptr;
  135.                             ^~~~~~~~
  136. In file included from /run/build/opencolorio/_flatpak_build/ext/yaml-cpp/src/nodeownership.cpp:2:
  137. /run/build/opencolorio/_flatpak_build/ext/yaml-cpp/include/yaml-cpp/node.h:117:8: warning: ‘template<class> class std::auto_ptr’ is deprecated [-Wdeprecated-declarations]
  138.    std::auto_ptr<NodeOwnership> m_pOwnership;
  139.         ^~~~~~~~
  140. In file included from /usr/include/c++/8.3.0/memory:80,
  141.                  from /run/build/opencolorio/_flatpak_build/ext/yaml-cpp/src/ptr_vector.h:11,
  142.                  from /run/build/opencolorio/_flatpak_build/ext/yaml-cpp/src/nodeownership.h:10,
  143.                  from /run/build/opencolorio/_flatpak_build/ext/yaml-cpp/src/nodeownership.cpp:1:
  144. /usr/include/c++/8.3.0/bits/unique_ptr.h:53:28: note: declared here
  145.    template<typename> class auto_ptr;
  146.                             ^~~~~~~~
  147. /run/build/opencolorio/_flatpak_build/ext/yaml-cpp/src/nodeownership.cpp: In member function ‘YAML::Node& YAML::NodeOwnership::_Create()’:
  148. /run/build/opencolorio/_flatpak_build/ext/yaml-cpp/src/nodeownership.cpp:18:26: warning: ‘template<class> class std::auto_ptr’ is deprecated [-Wdeprecated-declarations]
  149.    m_nodes.push_back(std::auto_ptr<Node>(new Node));
  150.                           ^~~~~~~~
  151. In file included from /usr/include/c++/8.3.0/memory:80,
  152.                  from /run/build/opencolorio/_flatpak_build/ext/yaml-cpp/src/ptr_vector.h:11,
  153.                  from /run/build/opencolorio/_flatpak_build/ext/yaml-cpp/src/nodeownership.h:10,
  154.                  from /run/build/opencolorio/_flatpak_build/ext/yaml-cpp/src/nodeownership.cpp:1:
  155. /usr/include/c++/8.3.0/bits/unique_ptr.h:53:28: note: declared here
  156.    template<typename> class auto_ptr;
  157.                             ^~~~~~~~
  158. [ 57%] Building CXX object CMakeFiles/yaml-cpp.dir/src/parser.cpp.o
  159. [ 60%] Building CXX object CMakeFiles/yaml-cpp.dir/src/regex.cpp.o
  160. In file included from /run/build/opencolorio/_flatpak_build/ext/yaml-cpp/include/yaml-cpp/node.h:14,
  161.                  from /run/build/opencolorio/_flatpak_build/ext/yaml-cpp/src/null.cpp:2:
  162. /run/build/opencolorio/_flatpak_build/ext/yaml-cpp/include/yaml-cpp/iterator.h:20:17: warning: ‘template<class> class std::auto_ptr’ is deprecated [-Wdeprecated-declarations]
  163.    Iterator(std::auto_ptr<IterPriv> pData);
  164.                  ^~~~~~~~
  165. In file included from /usr/include/c++/8.3.0/memory:80,
  166.                  from /run/build/opencolorio/_flatpak_build/ext/yaml-cpp/include/yaml-cpp/iterator.h:9,
  167.                  from /run/build/opencolorio/_flatpak_build/ext/yaml-cpp/include/yaml-cpp/node.h:14,
  168.                  from /run/build/opencolorio/_flatpak_build/ext/yaml-cpp/src/null.cpp:2:
  169. /usr/include/c++/8.3.0/bits/unique_ptr.h:53:28: note: declared here
  170.    template<typename> class auto_ptr;
  171.                             ^~~~~~~~
  172. In file included from /run/build/opencolorio/_flatpak_build/ext/yaml-cpp/include/yaml-cpp/node.h:14,
  173.                  from /run/build/opencolorio/_flatpak_build/ext/yaml-cpp/src/null.cpp:2:
  174. /run/build/opencolorio/_flatpak_build/ext/yaml-cpp/include/yaml-cpp/iterator.h:36:8: warning: ‘template<class> class std::auto_ptr’ is deprecated [-Wdeprecated-declarations]
  175.    std::auto_ptr<IterPriv> m_pData;
  176.         ^~~~~~~~
  177. In file included from /usr/include/c++/8.3.0/memory:80,
  178.                  from /run/build/opencolorio/_flatpak_build/ext/yaml-cpp/include/yaml-cpp/iterator.h:9,
  179.                  from /run/build/opencolorio/_flatpak_build/ext/yaml-cpp/include/yaml-cpp/node.h:14,
  180.                  from /run/build/opencolorio/_flatpak_build/ext/yaml-cpp/src/null.cpp:2:
  181. /usr/include/c++/8.3.0/bits/unique_ptr.h:53:28: note: declared here
  182.    template<typename> class auto_ptr;
  183.                             ^~~~~~~~
  184. In file included from /run/build/opencolorio/_flatpak_build/ext/yaml-cpp/src/null.cpp:2:
  185. /run/build/opencolorio/_flatpak_build/ext/yaml-cpp/include/yaml-cpp/node.h:43:8: warning: ‘template<class> class std::auto_ptr’ is deprecated [-Wdeprecated-declarations]
  186.    std::auto_ptr<Node> Clone() const;
  187.         ^~~~~~~~
  188. In file included from /usr/include/c++/8.3.0/memory:80,
  189.                  from /run/build/opencolorio/_flatpak_build/ext/yaml-cpp/include/yaml-cpp/iterator.h:9,
  190.                  from /run/build/opencolorio/_flatpak_build/ext/yaml-cpp/include/yaml-cpp/node.h:14,
  191.                  from /run/build/opencolorio/_flatpak_build/ext/yaml-cpp/src/null.cpp:2:
  192. /usr/include/c++/8.3.0/bits/unique_ptr.h:53:28: note: declared here
  193.    template<typename> class auto_ptr;
  194.                             ^~~~~~~~
  195. In file included from /run/build/opencolorio/_flatpak_build/ext/yaml-cpp/src/null.cpp:2:
  196. /run/build/opencolorio/_flatpak_build/ext/yaml-cpp/include/yaml-cpp/node.h:117:8: warning: ‘template<class> class std::auto_ptr’ is deprecated [-Wdeprecated-declarations]
  197.    std::auto_ptr<NodeOwnership> m_pOwnership;
  198.         ^~~~~~~~
  199. In file included from /usr/include/c++/8.3.0/memory:80,
  200.                  from /run/build/opencolorio/_flatpak_build/ext/yaml-cpp/include/yaml-cpp/iterator.h:9,
  201.                  from /run/build/opencolorio/_flatpak_build/ext/yaml-cpp/include/yaml-cpp/node.h:14,
  202.                  from /run/build/opencolorio/_flatpak_build/ext/yaml-cpp/src/null.cpp:2:
  203. /usr/include/c++/8.3.0/bits/unique_ptr.h:53:28: note: declared here
  204.    template<typename> class auto_ptr;
  205.                             ^~~~~~~~
  206. [ 64%] Building CXX object CMakeFiles/yaml-cpp.dir/src/scanner.cpp.o
  207. [ 67%] Building CXX object CMakeFiles/yaml-cpp.dir/src/scanscalar.cpp.o
  208. In file included from /run/build/opencolorio/_flatpak_build/ext/yaml-cpp/src/regex.cpp:1:
  209. /run/build/opencolorio/_flatpak_build/ext/yaml-cpp/src/regex.h: In constructor ‘YAML::RegEx::RegEx(const string&, YAML::REGEX_OP)’:
  210. /run/build/opencolorio/_flatpak_build/ext/yaml-cpp/src/regex.h:21:8: warning: ‘<anonymous>.YAML::RegEx::m_z’ may be used uninitialized in this function [-Wmaybe-uninitialized]
  211.   class RegEx
  212.         ^~~~~
  213. [ 71%] Building CXX object CMakeFiles/yaml-cpp.dir/src/scantag.cpp.o
  214. In file included from /run/build/opencolorio/_flatpak_build/ext/yaml-cpp/src/parser.cpp:1:
  215. /run/build/opencolorio/_flatpak_build/ext/yaml-cpp/include/yaml-cpp/parser.h:46:8: warning: ‘template<class> class std::auto_ptr’ is deprecated [-Wdeprecated-declarations]
  216.    std::auto_ptr<Scanner> m_pScanner;
  217.         ^~~~~~~~
  218. In file included from /usr/include/c++/8.3.0/memory:80,
  219.                  from /run/build/opencolorio/_flatpak_build/ext/yaml-cpp/include/yaml-cpp/parser.h:12,
  220.                  from /run/build/opencolorio/_flatpak_build/ext/yaml-cpp/src/parser.cpp:1:
  221. /usr/include/c++/8.3.0/bits/unique_ptr.h:53:28: note: declared here
  222.    template<typename> class auto_ptr;
  223.                             ^~~~~~~~
  224. In file included from /run/build/opencolorio/_flatpak_build/ext/yaml-cpp/src/parser.cpp:1:
  225. /run/build/opencolorio/_flatpak_build/ext/yaml-cpp/include/yaml-cpp/parser.h:47:8: warning: ‘template<class> class std::auto_ptr’ is deprecated [-Wdeprecated-declarations]
  226.    std::auto_ptr<Directives> m_pDirectives;
  227.         ^~~~~~~~
  228. In file included from /usr/include/c++/8.3.0/memory:80,
  229.                  from /run/build/opencolorio/_flatpak_build/ext/yaml-cpp/include/yaml-cpp/parser.h:12,
  230.                  from /run/build/opencolorio/_flatpak_build/ext/yaml-cpp/src/parser.cpp:1:
  231. /usr/include/c++/8.3.0/bits/unique_ptr.h:53:28: note: declared here
  232.    template<typename> class auto_ptr;
  233.                             ^~~~~~~~
  234. In file included from /run/build/opencolorio/_flatpak_build/ext/yaml-cpp/include/yaml-cpp/node.h:14,
  235.                  from /run/build/opencolorio/_flatpak_build/ext/yaml-cpp/src/parser.cpp:4:
  236. /run/build/opencolorio/_flatpak_build/ext/yaml-cpp/include/yaml-cpp/iterator.h:20:17: warning: ‘template<class> class std::auto_ptr’ is deprecated [-Wdeprecated-declarations]
  237.    Iterator(std::auto_ptr<IterPriv> pData);
  238.                  ^~~~~~~~
  239. In file included from /usr/include/c++/8.3.0/memory:80,
  240.                  from /run/build/opencolorio/_flatpak_build/ext/yaml-cpp/include/yaml-cpp/parser.h:12,
  241.                  from /run/build/opencolorio/_flatpak_build/ext/yaml-cpp/src/parser.cpp:1:
  242. /usr/include/c++/8.3.0/bits/unique_ptr.h:53:28: note: declared here
  243.    template<typename> class auto_ptr;
  244.                             ^~~~~~~~
  245. In file included from /run/build/opencolorio/_flatpak_build/ext/yaml-cpp/include/yaml-cpp/node.h:14,
  246.                  from /run/build/opencolorio/_flatpak_build/ext/yaml-cpp/src/parser.cpp:4:
  247. /run/build/opencolorio/_flatpak_build/ext/yaml-cpp/include/yaml-cpp/iterator.h:36:8: warning: ‘template<class> class std::auto_ptr’ is deprecated [-Wdeprecated-declarations]
  248.    std::auto_ptr<IterPriv> m_pData;
  249.         ^~~~~~~~
  250. In file included from /usr/include/c++/8.3.0/memory:80,
  251.                  from /run/build/opencolorio/_flatpak_build/ext/yaml-cpp/include/yaml-cpp/parser.h:12,
  252.                  from /run/build/opencolorio/_flatpak_build/ext/yaml-cpp/src/parser.cpp:1:
  253. /usr/include/c++/8.3.0/bits/unique_ptr.h:53:28: note: declared here
  254.    template<typename> class auto_ptr;
  255.                             ^~~~~~~~
  256. In file included from /run/build/opencolorio/_flatpak_build/ext/yaml-cpp/src/parser.cpp:4:
  257. /run/build/opencolorio/_flatpak_build/ext/yaml-cpp/include/yaml-cpp/node.h:43:8: warning: ‘template<class> class std::auto_ptr’ is deprecated [-Wdeprecated-declarations]
  258.    std::auto_ptr<Node> Clone() const;
  259.         ^~~~~~~~
  260. In file included from /usr/include/c++/8.3.0/memory:80,
  261.                  from /run/build/opencolorio/_flatpak_build/ext/yaml-cpp/include/yaml-cpp/parser.h:12,
  262.                  from /run/build/opencolorio/_flatpak_build/ext/yaml-cpp/src/parser.cpp:1:
  263. /usr/include/c++/8.3.0/bits/unique_ptr.h:53:28: note: declared here
  264.    template<typename> class auto_ptr;
  265.                             ^~~~~~~~
  266. In file included from /run/build/opencolorio/_flatpak_build/ext/yaml-cpp/src/parser.cpp:4:
  267. /run/build/opencolorio/_flatpak_build/ext/yaml-cpp/include/yaml-cpp/node.h:117:8: warning: ‘template<class> class std::auto_ptr’ is deprecated [-Wdeprecated-declarations]
  268.    std::auto_ptr<NodeOwnership> m_pOwnership;
  269.         ^~~~~~~~
  270. In file included from /usr/include/c++/8.3.0/memory:80,
  271.                  from /run/build/opencolorio/_flatpak_build/ext/yaml-cpp/include/yaml-cpp/parser.h:12,
  272.                  from /run/build/opencolorio/_flatpak_build/ext/yaml-cpp/src/parser.cpp:1:
  273. /usr/include/c++/8.3.0/bits/unique_ptr.h:53:28: note: declared here
  274.    template<typename> class auto_ptr;
  275.                             ^~~~~~~~
  276. In file included from /run/build/opencolorio/_flatpak_build/ext/yaml-cpp/src/scanner.h:15,
  277.                  from /run/build/opencolorio/_flatpak_build/ext/yaml-cpp/src/parser.cpp:7:
  278. /run/build/opencolorio/_flatpak_build/ext/yaml-cpp/src/ptr_vector.h:32:23: warning: ‘template<class> class std::auto_ptr’ is deprecated [-Wdeprecated-declarations]
  279.    void push_back(std::auto_ptr<T> t) {
  280.                        ^~~~~~~~
  281. In file included from /usr/include/c++/8.3.0/memory:80,
  282.                  from /run/build/opencolorio/_flatpak_build/ext/yaml-cpp/include/yaml-cpp/parser.h:12,
  283.                  from /run/build/opencolorio/_flatpak_build/ext/yaml-cpp/src/parser.cpp:1:
  284. /usr/include/c++/8.3.0/bits/unique_ptr.h:53:28: note: declared here
  285.    template<typename> class auto_ptr;
  286.                             ^~~~~~~~
  287. In file included from /run/build/opencolorio/_flatpak_build/ext/yaml-cpp/src/parser.cpp:8:
  288. /run/build/opencolorio/_flatpak_build/ext/yaml-cpp/src/singledocparser.h:56:8: warning: ‘template<class> class std::auto_ptr’ is deprecated [-Wdeprecated-declarations]
  289.    std::auto_ptr<CollectionStack> m_pCollectionStack;
  290.         ^~~~~~~~
  291. In file included from /usr/include/c++/8.3.0/memory:80,
  292.                  from /run/build/opencolorio/_flatpak_build/ext/yaml-cpp/include/yaml-cpp/parser.h:12,
  293.                  from /run/build/opencolorio/_flatpak_build/ext/yaml-cpp/src/parser.cpp:1:
  294. /usr/include/c++/8.3.0/bits/unique_ptr.h:53:28: note: declared here
  295.    template<typename> class auto_ptr;
  296.                             ^~~~~~~~
  297. [ 75%] Building CXX object CMakeFiles/yaml-cpp.dir/src/scantoken.cpp.o
  298. In file included from /run/build/opencolorio/_flatpak_build/ext/yaml-cpp/src/scanner.h:15,
  299.                  from /run/build/opencolorio/_flatpak_build/ext/yaml-cpp/src/scanscalar.cpp:2:
  300. /run/build/opencolorio/_flatpak_build/ext/yaml-cpp/src/ptr_vector.h:32:23: warning: ‘template<class> class std::auto_ptr’ is deprecated [-Wdeprecated-declarations]
  301.    void push_back(std::auto_ptr<T> t) {
  302.                        ^~~~~~~~
  303. In file included from /usr/include/c++/8.3.0/memory:80,
  304.                  from /run/build/opencolorio/_flatpak_build/ext/yaml-cpp/src/ptr_vector.h:11,
  305.                  from /run/build/opencolorio/_flatpak_build/ext/yaml-cpp/src/scanner.h:15,
  306.                  from /run/build/opencolorio/_flatpak_build/ext/yaml-cpp/src/scanscalar.cpp:2:
  307. /usr/include/c++/8.3.0/bits/unique_ptr.h:53:28: note: declared here
  308.    template<typename> class auto_ptr;
  309.                             ^~~~~~~~
  310. [ 78%] Building CXX object CMakeFiles/yaml-cpp.dir/src/simplekey.cpp.o
  311. In file included from /run/build/opencolorio/_flatpak_build/ext/yaml-cpp/src/scanner.h:15,
  312.                  from /run/build/opencolorio/_flatpak_build/ext/yaml-cpp/src/scantag.cpp:1:
  313. /run/build/opencolorio/_flatpak_build/ext/yaml-cpp/src/ptr_vector.h:32:23: warning: ‘template<class> class std::auto_ptr’ is deprecated [-Wdeprecated-declarations]
  314.    void push_back(std::auto_ptr<T> t) {
  315.                        ^~~~~~~~
  316. In file included from /usr/include/c++/8.3.0/memory:80,
  317.                  from /run/build/opencolorio/_flatpak_build/ext/yaml-cpp/src/ptr_vector.h:11,
  318.                  from /run/build/opencolorio/_flatpak_build/ext/yaml-cpp/src/scanner.h:15,
  319.                  from /run/build/opencolorio/_flatpak_build/ext/yaml-cpp/src/scantag.cpp:1:
  320. /usr/include/c++/8.3.0/bits/unique_ptr.h:53:28: note: declared here
  321.    template<typename> class auto_ptr;
  322.                             ^~~~~~~~
  323. [ 82%] Building CXX object CMakeFiles/yaml-cpp.dir/src/singledocparser.cpp.o
  324. In file included from /run/build/opencolorio/_flatpak_build/ext/yaml-cpp/src/scanner.h:15,
  325.                  from /run/build/opencolorio/_flatpak_build/ext/yaml-cpp/src/scanner.cpp:1:
  326. /run/build/opencolorio/_flatpak_build/ext/yaml-cpp/src/ptr_vector.h:32:23: warning: ‘template<class> class std::auto_ptr’ is deprecated [-Wdeprecated-declarations]
  327.    void push_back(std::auto_ptr<T> t) {
  328.                        ^~~~~~~~
  329. In file included from /usr/include/c++/8.3.0/memory:80,
  330.                  from /run/build/opencolorio/_flatpak_build/ext/yaml-cpp/src/ptr_vector.h:11,
  331.                  from /run/build/opencolorio/_flatpak_build/ext/yaml-cpp/src/scanner.h:15,
  332.                  from /run/build/opencolorio/_flatpak_build/ext/yaml-cpp/src/scanner.cpp:1:
  333. /usr/include/c++/8.3.0/bits/unique_ptr.h:53:28: note: declared here
  334.    template<typename> class auto_ptr;
  335.                             ^~~~~~~~
  336. /run/build/opencolorio/_flatpak_build/ext/yaml-cpp/src/scanner.cpp: In member function ‘void YAML::Scanner::StartStream()’:
  337. /run/build/opencolorio/_flatpak_build/ext/yaml-cpp/src/scanner.cpp:237:8: warning: ‘template<class> class std::auto_ptr’ is deprecated [-Wdeprecated-declarations]
  338.    std::auto_ptr<IndentMarker> pIndent(new IndentMarker(-1, IndentMarker::NONE));
  339.         ^~~~~~~~
  340. In file included from /usr/include/c++/8.3.0/memory:80,
  341.                  from /run/build/opencolorio/_flatpak_build/ext/yaml-cpp/src/ptr_vector.h:11,
  342.                  from /run/build/opencolorio/_flatpak_build/ext/yaml-cpp/src/scanner.h:15,
  343.                  from /run/build/opencolorio/_flatpak_build/ext/yaml-cpp/src/scanner.cpp:1:
  344. /usr/include/c++/8.3.0/bits/unique_ptr.h:53:28: note: declared here
  345.    template<typename> class auto_ptr;
  346.                             ^~~~~~~~
  347. /run/build/opencolorio/_flatpak_build/ext/yaml-cpp/src/scanner.cpp: In member function ‘YAML::Scanner::IndentMarker* YAML::Scanner::PushIndentTo(int, YAML::Scanner::IndentMarker::INDENT_TYPE)’:
  348. /run/build/opencolorio/_flatpak_build/ext/yaml-cpp/src/scanner.cpp:284:8: warning: ‘template<class> class std::auto_ptr’ is deprecated [-Wdeprecated-declarations]
  349.    std::auto_ptr<IndentMarker> pIndent(new IndentMarker(column, type));
  350.         ^~~~~~~~
  351. In file included from /usr/include/c++/8.3.0/memory:80,
  352.                  from /run/build/opencolorio/_flatpak_build/ext/yaml-cpp/src/ptr_vector.h:11,
  353.                  from /run/build/opencolorio/_flatpak_build/ext/yaml-cpp/src/scanner.h:15,
  354.                  from /run/build/opencolorio/_flatpak_build/ext/yaml-cpp/src/scanner.cpp:1:
  355. /usr/include/c++/8.3.0/bits/unique_ptr.h:53:28: note: declared here
  356.    template<typename> class auto_ptr;
  357.                             ^~~~~~~~
  358. [ 85%] Building CXX object CMakeFiles/yaml-cpp.dir/src/stream.cpp.o
  359. In file included from /run/build/opencolorio/_flatpak_build/ext/yaml-cpp/src/scanner.h:15,
  360.                  from /run/build/opencolorio/_flatpak_build/ext/yaml-cpp/src/simplekey.cpp:1:
  361. /run/build/opencolorio/_flatpak_build/ext/yaml-cpp/src/ptr_vector.h:32:23: warning: ‘template<class> class std::auto_ptr’ is deprecated [-Wdeprecated-declarations]
  362.    void push_back(std::auto_ptr<T> t) {
  363.                        ^~~~~~~~
  364. In file included from /usr/include/c++/8.3.0/memory:80,
  365.                  from /run/build/opencolorio/_flatpak_build/ext/yaml-cpp/src/ptr_vector.h:11,
  366.                  from /run/build/opencolorio/_flatpak_build/ext/yaml-cpp/src/scanner.h:15,
  367.                  from /run/build/opencolorio/_flatpak_build/ext/yaml-cpp/src/simplekey.cpp:1:
  368. /usr/include/c++/8.3.0/bits/unique_ptr.h:53:28: note: declared here
  369.    template<typename> class auto_ptr;
  370.                             ^~~~~~~~
  371. [ 89%] Building CXX object CMakeFiles/yaml-cpp.dir/src/tag.cpp.o
  372. [ 92%] Building CXX object CMakeFiles/yaml-cpp.dir/src/contrib/graphbuilder.cpp.o
  373. [ 96%] Building CXX object CMakeFiles/yaml-cpp.dir/src/contrib/graphbuilderadapter.cpp.o
  374. In file included from /run/build/opencolorio/_flatpak_build/ext/yaml-cpp/src/contrib/graphbuilder.cpp:1:
  375. /run/build/opencolorio/_flatpak_build/ext/yaml-cpp/include/yaml-cpp/parser.h:46:8: warning: ‘template<class> class std::auto_ptr’ is deprecated [-Wdeprecated-declarations]
  376.    std::auto_ptr<Scanner> m_pScanner;
  377.         ^~~~~~~~
  378. In file included from /usr/include/c++/8.3.0/memory:80,
  379.                  from /run/build/opencolorio/_flatpak_build/ext/yaml-cpp/include/yaml-cpp/parser.h:12,
  380.                  from /run/build/opencolorio/_flatpak_build/ext/yaml-cpp/src/contrib/graphbuilder.cpp:1:
  381. /usr/include/c++/8.3.0/bits/unique_ptr.h:53:28: note: declared here
  382.    template<typename> class auto_ptr;
  383.                             ^~~~~~~~
  384. In file included from /run/build/opencolorio/_flatpak_build/ext/yaml-cpp/src/contrib/graphbuilder.cpp:1:
  385. /run/build/opencolorio/_flatpak_build/ext/yaml-cpp/include/yaml-cpp/parser.h:47:8: warning: ‘template<class> class std::auto_ptr’ is deprecated [-Wdeprecated-declarations]
  386.    std::auto_ptr<Directives> m_pDirectives;
  387.         ^~~~~~~~
  388. In file included from /usr/include/c++/8.3.0/memory:80,
  389.                  from /run/build/opencolorio/_flatpak_build/ext/yaml-cpp/include/yaml-cpp/parser.h:12,
  390.                  from /run/build/opencolorio/_flatpak_build/ext/yaml-cpp/src/contrib/graphbuilder.cpp:1:
  391. /usr/include/c++/8.3.0/bits/unique_ptr.h:53:28: note: declared here
  392.    template<typename> class auto_ptr;
  393.                             ^~~~~~~~
  394. In file included from /run/build/opencolorio/_flatpak_build/ext/yaml-cpp/src/scanner.h:15,
  395.                  from /run/build/opencolorio/_flatpak_build/ext/yaml-cpp/src/scantoken.cpp:1:
  396. /run/build/opencolorio/_flatpak_build/ext/yaml-cpp/src/ptr_vector.h:32:23: warning: ‘template<class> class std::auto_ptr’ is deprecated [-Wdeprecated-declarations]
  397.    void push_back(std::auto_ptr<T> t) {
  398.                        ^~~~~~~~
  399. In file included from /usr/include/c++/8.3.0/memory:80,
  400.                  from /run/build/opencolorio/_flatpak_build/ext/yaml-cpp/src/ptr_vector.h:11,
  401.                  from /run/build/opencolorio/_flatpak_build/ext/yaml-cpp/src/scanner.h:15,
  402.                  from /run/build/opencolorio/_flatpak_build/ext/yaml-cpp/src/scantoken.cpp:1:
  403. /usr/include/c++/8.3.0/bits/unique_ptr.h:53:28: note: declared here
  404.    template<typename> class auto_ptr;
  405.                             ^~~~~~~~
  406. In file included from /run/build/opencolorio/_flatpak_build/ext/yaml-cpp/src/singledocparser.cpp:1:
  407. /run/build/opencolorio/_flatpak_build/ext/yaml-cpp/src/singledocparser.h:56:8: warning: ‘template<class> class std::auto_ptr’ is deprecated [-Wdeprecated-declarations]
  408.    std::auto_ptr<CollectionStack> m_pCollectionStack;
  409.         ^~~~~~~~
  410. In file included from /usr/include/c++/8.3.0/memory:80,
  411.                  from /run/build/opencolorio/_flatpak_build/ext/yaml-cpp/src/singledocparser.h:13,
  412.                  from /run/build/opencolorio/_flatpak_build/ext/yaml-cpp/src/singledocparser.cpp:1:
  413. /usr/include/c++/8.3.0/bits/unique_ptr.h:53:28: note: declared here
  414.    template<typename> class auto_ptr;
  415.                             ^~~~~~~~
  416. In file included from /run/build/opencolorio/_flatpak_build/ext/yaml-cpp/src/scanner.h:15,
  417.                  from /run/build/opencolorio/_flatpak_build/ext/yaml-cpp/src/singledocparser.cpp:6:
  418. /run/build/opencolorio/_flatpak_build/ext/yaml-cpp/src/ptr_vector.h:32:23: warning: ‘template<class> class std::auto_ptr’ is deprecated [-Wdeprecated-declarations]
  419.    void push_back(std::auto_ptr<T> t) {
  420.                        ^~~~~~~~
  421. In file included from /usr/include/c++/8.3.0/memory:80,
  422.                  from /run/build/opencolorio/_flatpak_build/ext/yaml-cpp/src/singledocparser.h:13,
  423.                  from /run/build/opencolorio/_flatpak_build/ext/yaml-cpp/src/singledocparser.cpp:1:
  424. /usr/include/c++/8.3.0/bits/unique_ptr.h:53:28: note: declared here
  425.    template<typename> class auto_ptr;
  426.                             ^~~~~~~~
  427. [100%] Linking CXX static library libyaml-cpp.a
  428. [100%] Built target yaml-cpp
  429. [  7%] Performing install step for 'YAML_CPP_LOCAL'
  430. [100%] Built target yaml-cpp
  431. Install the project...
  432. -- Install configuration: "RelWithDebInfo"
  433. -- Installing: /run/build/opencolorio/_flatpak_build/ext/dist/lib/libyaml-cpp.a
  434. -- Installing: /run/build/opencolorio/_flatpak_build/ext/dist/include/yaml-cpp
  435. -- Installing: /run/build/opencolorio/_flatpak_build/ext/dist/include/yaml-cpp/conversion.h
  436. -- Installing: /run/build/opencolorio/_flatpak_build/ext/dist/include/yaml-cpp/stlemitter.h
  437. -- Installing: /run/build/opencolorio/_flatpak_build/ext/dist/include/yaml-cpp/anchor.h
  438. -- Installing: /run/build/opencolorio/_flatpak_build/ext/dist/include/yaml-cpp/nodereadimpl.h
  439. -- Installing: /run/build/opencolorio/_flatpak_build/ext/dist/include/yaml-cpp/emitter.h
  440. -- Installing: /run/build/opencolorio/_flatpak_build/ext/dist/include/yaml-cpp/null.h
  441. -- Installing: /run/build/opencolorio/_flatpak_build/ext/dist/include/yaml-cpp/ostream.h
  442. -- Installing: /run/build/opencolorio/_flatpak_build/ext/dist/include/yaml-cpp/binary.h
  443. -- Installing: /run/build/opencolorio/_flatpak_build/ext/dist/include/yaml-cpp/node.h
  444. -- Installing: /run/build/opencolorio/_flatpak_build/ext/dist/include/yaml-cpp/eventhandler.h
  445. -- Installing: /run/build/opencolorio/_flatpak_build/ext/dist/include/yaml-cpp/emittermanip.h
  446. -- Installing: /run/build/opencolorio/_flatpak_build/ext/dist/include/yaml-cpp/nodeutil.h
  447. -- Installing: /run/build/opencolorio/_flatpak_build/ext/dist/include/yaml-cpp/parser.h
  448. -- Installing: /run/build/opencolorio/_flatpak_build/ext/dist/include/yaml-cpp/traits.h
  449. -- Installing: /run/build/opencolorio/_flatpak_build/ext/dist/include/yaml-cpp/noncopyable.h
  450. -- Installing: /run/build/opencolorio/_flatpak_build/ext/dist/include/yaml-cpp/mark.h
  451. -- Installing: /run/build/opencolorio/_flatpak_build/ext/dist/include/yaml-cpp/stlnode.h
  452. -- Installing: /run/build/opencolorio/_flatpak_build/ext/dist/include/yaml-cpp/exceptions.h
  453. -- Installing: /run/build/opencolorio/_flatpak_build/ext/dist/include/yaml-cpp/aliasmanager.h
  454. -- Installing: /run/build/opencolorio/_flatpak_build/ext/dist/include/yaml-cpp/yaml.h
  455. -- Installing: /run/build/opencolorio/_flatpak_build/ext/dist/include/yaml-cpp/ltnode.h
  456. -- Installing: /run/build/opencolorio/_flatpak_build/ext/dist/include/yaml-cpp/dll.h
  457. -- Installing: /run/build/opencolorio/_flatpak_build/ext/dist/include/yaml-cpp/nodeimpl.h
  458. -- Installing: /run/build/opencolorio/_flatpak_build/ext/dist/include/yaml-cpp/contrib
  459. -- Installing: /run/build/opencolorio/_flatpak_build/ext/dist/include/yaml-cpp/contrib/graphbuilder.h
  460. -- Installing: /run/build/opencolorio/_flatpak_build/ext/dist/include/yaml-cpp/contrib/anchordict.h
  461. -- Installing: /run/build/opencolorio/_flatpak_build/ext/dist/include/yaml-cpp/iterator.h
  462. -- Installing: /run/build/opencolorio/_flatpak_build/ext/dist/include/yaml-cpp/emitfromevents.h
  463. -- Installing: /run/build/opencolorio/_flatpak_build/ext/dist/lib/pkgconfig/yaml-cpp.pc
  464. [  7%] Completed 'YAML_CPP_LOCAL'
  465. [  7%] Built target YAML_CPP_LOCAL
  466. Scanning dependencies of target OpenColorIO_STATIC
  467. Scanning dependencies of target OpenColorIO
  468. Scanning dependencies of target ocio_core_tests
  469. [  7%] Building CXX object src/core/CMakeFiles/OpenColorIO.dir/AllocationOp.cpp.o
  470. [  8%] Building CXX object src/core/CMakeFiles/OpenColorIO_STATIC.dir/AllocationOp.cpp.o
  471. [  9%] Building CXX object src/core/CMakeFiles/OpenColorIO.dir/AllocationTransform.cpp.o
  472. [ 10%] Building CXX object src/core_tests/CMakeFiles/ocio_core_tests.dir/__/core/AllocationOp.cpp.o
  473. [ 10%] Building CXX object src/core/CMakeFiles/OpenColorIO_STATIC.dir/AllocationTransform.cpp.o
  474. [ 11%] Building CXX object src/core/CMakeFiles/OpenColorIO_STATIC.dir/Baker.cpp.o
  475. [ 11%] Building CXX object src/core_tests/CMakeFiles/ocio_core_tests.dir/__/core/AllocationTransform.cpp.o
  476. [ 11%] Building CXX object src/core/CMakeFiles/OpenColorIO.dir/Baker.cpp.o
  477. [ 11%] Building CXX object src/core/CMakeFiles/OpenColorIO_STATIC.dir/CDLTransform.cpp.o
  478. [ 12%] Building CXX object src/core_tests/CMakeFiles/ocio_core_tests.dir/__/core/Baker.cpp.o
  479. [ 12%] Building CXX object src/core/CMakeFiles/OpenColorIO_STATIC.dir/Caching.cpp.o
  480. [ 13%] Building CXX object src/core/CMakeFiles/OpenColorIO.dir/CDLTransform.cpp.o
  481. [ 14%] Building CXX object src/core/CMakeFiles/OpenColorIO_STATIC.dir/ColorSpace.cpp.o
  482. [ 14%] Building CXX object src/core_tests/CMakeFiles/ocio_core_tests.dir/__/core/CDLTransform.cpp.o
  483. [ 14%] Building CXX object src/core/CMakeFiles/OpenColorIO_STATIC.dir/ColorSpaceTransform.cpp.o
  484. [ 15%] Building CXX object src/core/CMakeFiles/OpenColorIO_STATIC.dir/Config.cpp.o
  485. [ 15%] Building CXX object src/core/CMakeFiles/OpenColorIO_STATIC.dir/Context.cpp.o
  486. [ 15%] Building CXX object src/core/CMakeFiles/OpenColorIO.dir/Caching.cpp.o
  487. [ 15%] Building CXX object src/core_tests/CMakeFiles/ocio_core_tests.dir/__/core/Caching.cpp.o
  488. [ 16%] Building CXX object src/core/CMakeFiles/OpenColorIO.dir/ColorSpace.cpp.o
  489. [ 17%] Building CXX object src/core_tests/CMakeFiles/ocio_core_tests.dir/__/core/ColorSpace.cpp.o
  490. [ 18%] Building CXX object src/core/CMakeFiles/OpenColorIO_STATIC.dir/Display.cpp.o
  491. [ 18%] Building CXX object src/core/CMakeFiles/OpenColorIO.dir/ColorSpaceTransform.cpp.o
  492. [ 18%] Building CXX object src/core_tests/CMakeFiles/ocio_core_tests.dir/__/core/ColorSpaceTransform.cpp.o
  493. [ 18%] Building CXX object src/core/CMakeFiles/OpenColorIO.dir/Config.cpp.o
  494. [ 18%] Building CXX object src/core/CMakeFiles/OpenColorIO_STATIC.dir/DisplayTransform.cpp.o
  495. [ 19%] Building CXX object src/core_tests/CMakeFiles/ocio_core_tests.dir/__/core/Config.cpp.o
  496. [ 19%] Building CXX object src/core/CMakeFiles/OpenColorIO_STATIC.dir/Exception.cpp.o
  497. [ 20%] Building CXX object src/core/CMakeFiles/OpenColorIO_STATIC.dir/ExponentOps.cpp.o
  498. [ 20%] Building CXX object src/core/CMakeFiles/OpenColorIO_STATIC.dir/ExponentTransform.cpp.o
  499. [ 21%] Building CXX object src/core/CMakeFiles/OpenColorIO_STATIC.dir/FileFormat3DL.cpp.o
  500. [ 21%] Building CXX object src/core/CMakeFiles/OpenColorIO_STATIC.dir/FileFormatCC.cpp.o
  501. [ 22%] Building CXX object src/core/CMakeFiles/OpenColorIO_STATIC.dir/FileFormatCCC.cpp.o
  502. [ 23%] Building CXX object src/core/CMakeFiles/OpenColorIO.dir/Context.cpp.o
  503. [ 23%] Building CXX object src/core/CMakeFiles/OpenColorIO_STATIC.dir/FileFormatCDL.cpp.o
  504. [ 23%] Building CXX object src/core/CMakeFiles/OpenColorIO_STATIC.dir/FileFormatCSP.cpp.o
  505. [ 24%] Building CXX object src/core/CMakeFiles/OpenColorIO_STATIC.dir/FileFormatHDL.cpp.o
  506. [ 24%] Building CXX object src/core/CMakeFiles/OpenColorIO.dir/Display.cpp.o
  507. [ 25%] Building CXX object src/core/CMakeFiles/OpenColorIO.dir/DisplayTransform.cpp.o
  508. [ 25%] Building CXX object src/core/CMakeFiles/OpenColorIO_STATIC.dir/FileFormatIridasCube.cpp.o
  509. /run/build/opencolorio/src/core/Config.cpp: In function ‘void oiiotest_Config_EnvCheck()’:
  510. /run/build/opencolorio/src/core/Config.cpp:1920:31: warning: cast from type ‘const char*’ to type ‘char*’ casts away qualifiers [-Wcast-qual]
  511.      putenv((char *)test.c_str());
  512.                                ^
  513. /run/build/opencolorio/src/core/Config.cpp:1922:32: warning: cast from type ‘const char*’ to type ‘char*’ casts away qualifiers [-Wcast-qual]
  514.      putenv((char *)test2.c_str());
  515.                                 ^
  516. /run/build/opencolorio/src/core/Config.cpp: In function ‘void oiiotest_Config_Env_colorspace_name()’:
  517. /run/build/opencolorio/src/core/Config.cpp:2043:30: warning: cast from type ‘const char*’ to type ‘char*’ casts away qualifiers [-Wcast-qual]
  518.          char * env = (char *)"CAMERARAW=lnh";
  519.                               ^~~~~~~~~~~~~~~
  520. /run/build/opencolorio/src/core/Config.cpp:2058:30: warning: cast from type ‘const char*’ to type ‘char*’ casts away qualifiers [-Wcast-qual]
  521.          char * env = (char *)"CAMERARAW=FaultyColorSpaceName";
  522.                               ^~~~~~~~~~~~~~~~~~~~~~~~~~~~~~~~
  523. [ 25%] Building CXX object src/core_tests/CMakeFiles/ocio_core_tests.dir/__/core/Context.cpp.o
  524. [ 25%] Building CXX object src/core/CMakeFiles/OpenColorIO.dir/Exception.cpp.o
  525. [ 26%] Building CXX object src/core/CMakeFiles/OpenColorIO_STATIC.dir/FileFormatIridasItx.cpp.o
  526. [ 27%] Building CXX object src/core/CMakeFiles/OpenColorIO.dir/ExponentOps.cpp.o
  527. [ 27%] Building CXX object src/core/CMakeFiles/OpenColorIO_STATIC.dir/FileFormatIridasLook.cpp.o
  528. [ 27%] Building CXX object src/core/CMakeFiles/OpenColorIO.dir/ExponentTransform.cpp.o
  529. [ 28%] Building CXX object src/core/CMakeFiles/OpenColorIO_STATIC.dir/FileFormatPandora.cpp.o
  530. [ 28%] Building CXX object src/core/CMakeFiles/OpenColorIO.dir/FileFormat3DL.cpp.o
  531. [ 29%] Building CXX object src/core_tests/CMakeFiles/ocio_core_tests.dir/__/core/Display.cpp.o
  532. [ 29%] Building CXX object src/core/CMakeFiles/OpenColorIO_STATIC.dir/FileFormatSpi1D.cpp.o
  533. [ 29%] Building CXX object src/core_tests/CMakeFiles/ocio_core_tests.dir/__/core/DisplayTransform.cpp.o
  534. [ 29%] Building CXX object src/core/CMakeFiles/OpenColorIO_STATIC.dir/FileFormatSpi3D.cpp.o
  535. [ 30%] Building CXX object src/core/CMakeFiles/OpenColorIO_STATIC.dir/FileFormatSpiMtx.cpp.o
  536. [ 30%] Building CXX object src/core/CMakeFiles/OpenColorIO_STATIC.dir/FileFormatTruelight.cpp.o
  537. [ 31%] Building CXX object src/core/CMakeFiles/OpenColorIO.dir/FileFormatCC.cpp.o
  538. [ 32%] Building CXX object src/core_tests/CMakeFiles/ocio_core_tests.dir/__/core/Exception.cpp.o
  539. [ 33%] Building CXX object src/core/CMakeFiles/OpenColorIO_STATIC.dir/FileFormatVF.cpp.o
  540. [ 33%] Building CXX object src/core_tests/CMakeFiles/ocio_core_tests.dir/__/core/ExponentOps.cpp.o
  541. [ 33%] Building CXX object src/core/CMakeFiles/OpenColorIO.dir/FileFormatCCC.cpp.o
  542. [ 33%] Building CXX object src/core/CMakeFiles/OpenColorIO_STATIC.dir/FileTransform.cpp.o
  543. [ 33%] Building CXX object src/core_tests/CMakeFiles/ocio_core_tests.dir/__/core/ExponentTransform.cpp.o
  544. [ 34%] Building CXX object src/core/CMakeFiles/OpenColorIO.dir/FileFormatCDL.cpp.o
  545. [ 35%] Building CXX object src/core/CMakeFiles/OpenColorIO_STATIC.dir/GpuShaderDesc.cpp.o
  546. [ 36%] Building CXX object src/core_tests/CMakeFiles/ocio_core_tests.dir/__/core/FileFormat3DL.cpp.o
  547. [ 36%] Building CXX object src/core/CMakeFiles/OpenColorIO_STATIC.dir/GpuShaderUtils.cpp.o
  548. [ 36%] Building CXX object src/core/CMakeFiles/OpenColorIO.dir/FileFormatCSP.cpp.o
  549. [ 36%] Building CXX object src/core/CMakeFiles/OpenColorIO_STATIC.dir/GroupTransform.cpp.o
  550. [ 37%] Building CXX object src/core/CMakeFiles/OpenColorIO_STATIC.dir/HashUtils.cpp.o
  551. [ 37%] Building CXX object src/core/CMakeFiles/OpenColorIO_STATIC.dir/ImageDesc.cpp.o
  552. [ 38%] Building CXX object src/core/CMakeFiles/OpenColorIO_STATIC.dir/ImagePacking.cpp.o
  553. [ 38%] Building CXX object src/core/CMakeFiles/OpenColorIO_STATIC.dir/LogOps.cpp.o
  554. [ 39%] Building CXX object src/core/CMakeFiles/OpenColorIO_STATIC.dir/LogTransform.cpp.o
  555. [ 39%] Building CXX object src/core_tests/CMakeFiles/ocio_core_tests.dir/__/core/FileFormatCC.cpp.o
  556. [ 39%] Building CXX object src/core/CMakeFiles/OpenColorIO_STATIC.dir/Logging.cpp.o
  557. [ 40%] Building CXX object src/core/CMakeFiles/OpenColorIO_STATIC.dir/Look.cpp.o
  558. [ 40%] Building CXX object src/core/CMakeFiles/OpenColorIO_STATIC.dir/LookParse.cpp.o
  559. [ 41%] Building CXX object src/core_tests/CMakeFiles/ocio_core_tests.dir/__/core/FileFormatCCC.cpp.o
  560. [ 41%] Building CXX object src/core/CMakeFiles/OpenColorIO_STATIC.dir/LookTransform.cpp.o
  561. [ 42%] Building CXX object src/core/CMakeFiles/OpenColorIO.dir/FileFormatHDL.cpp.o
  562. [ 43%] Building CXX object src/core/CMakeFiles/OpenColorIO_STATIC.dir/Lut1DOp.cpp.o
  563. [ 43%] Building CXX object src/core_tests/CMakeFiles/ocio_core_tests.dir/__/core/FileFormatCDL.cpp.o
  564. [ 43%] Building CXX object src/core/CMakeFiles/OpenColorIO_STATIC.dir/Lut3DOp.cpp.o
  565. [ 44%] Building CXX object src/core/CMakeFiles/OpenColorIO_STATIC.dir/MathUtils.cpp.o
  566. [ 45%] Building CXX object src/core_tests/CMakeFiles/ocio_core_tests.dir/__/core/FileFormatCSP.cpp.o
  567. [ 45%] Building CXX object src/core/CMakeFiles/OpenColorIO_STATIC.dir/MatrixOps.cpp.o
  568. [ 46%] Building CXX object src/core/CMakeFiles/OpenColorIO_STATIC.dir/MatrixTransform.cpp.o
  569. [ 46%] Building CXX object src/core/CMakeFiles/OpenColorIO_STATIC.dir/NoOps.cpp.o
  570. [ 46%] Building CXX object src/core/CMakeFiles/OpenColorIO_STATIC.dir/OCIOYaml.cpp.o
  571. [ 46%] Building CXX object src/core/CMakeFiles/OpenColorIO.dir/FileFormatIridasCube.cpp.o
  572. [ 47%] Building CXX object src/core/CMakeFiles/OpenColorIO_STATIC.dir/Op.cpp.o
  573. [ 47%] Building CXX object src/core/CMakeFiles/OpenColorIO_STATIC.dir/OpOptimizers.cpp.o
  574. [ 47%] Building CXX object src/core_tests/CMakeFiles/ocio_core_tests.dir/__/core/FileFormatHDL.cpp.o
  575. [ 47%] Building CXX object src/core/CMakeFiles/OpenColorIO.dir/FileFormatIridasItx.cpp.o
  576. [ 48%] Building CXX object src/core/CMakeFiles/OpenColorIO_STATIC.dir/ParseUtils.cpp.o
  577. [ 49%] Building CXX object src/core/CMakeFiles/OpenColorIO.dir/FileFormatIridasLook.cpp.o
  578. In file included from /run/build/opencolorio/_flatpak_build/ext/dist/include/yaml-cpp/yaml.h:8,
  579.                  from /run/build/opencolorio/src/core/OCIOYaml.cpp:75:
  580. /run/build/opencolorio/_flatpak_build/ext/dist/include/yaml-cpp/parser.h:46:8: error: ‘template<class> class std::auto_ptr’ is deprecated [-Werror=deprecated-declarations]
  581.    std::auto_ptr<Scanner> m_pScanner;
  582.         ^~~~~~~~
  583. In file included from /usr/include/c++/8.3.0/memory:80,
  584.                  from /usr/include/c++/8.3.0/tr1/memory:39,
  585.                  from /run/build/opencolorio/_flatpak_build/export/OpenColorABI.h:63,
  586.                  from /run/build/opencolorio/export/OpenColorIO/OpenColorIO.h:38,
  587.                  from /run/build/opencolorio/src/core/OCIOYaml.cpp:31:
  588. /usr/include/c++/8.3.0/bits/unique_ptr.h:53:28: note: declared here
  589.    template<typename> class auto_ptr;
  590.                             ^~~~~~~~
  591. In file included from /run/build/opencolorio/_flatpak_build/ext/dist/include/yaml-cpp/yaml.h:8,
  592.                  from /run/build/opencolorio/src/core/OCIOYaml.cpp:75:
  593. /run/build/opencolorio/_flatpak_build/ext/dist/include/yaml-cpp/parser.h:47:8: error: ‘template<class> class std::auto_ptr’ is deprecated [-Werror=deprecated-declarations]
  594.    std::auto_ptr<Directives> m_pDirectives;
  595.         ^~~~~~~~
  596. In file included from /usr/include/c++/8.3.0/memory:80,
  597.                  from /usr/include/c++/8.3.0/tr1/memory:39,
  598.                  from /run/build/opencolorio/_flatpak_build/export/OpenColorABI.h:63,
  599.                  from /run/build/opencolorio/export/OpenColorIO/OpenColorIO.h:38,
  600.                  from /run/build/opencolorio/src/core/OCIOYaml.cpp:31:
  601. /usr/include/c++/8.3.0/bits/unique_ptr.h:53:28: note: declared here
  602.    template<typename> class auto_ptr;
  603.                             ^~~~~~~~
  604. In file included from /run/build/opencolorio/_flatpak_build/ext/dist/include/yaml-cpp/yaml.h:9,
  605.                  from /run/build/opencolorio/src/core/OCIOYaml.cpp:75:
  606. /run/build/opencolorio/_flatpak_build/ext/dist/include/yaml-cpp/emitter.h:105:8: error: ‘template<class> class std::auto_ptr’ is deprecated [-Werror=deprecated-declarations]
  607.    std::auto_ptr <EmitterState> m_pState;
  608.         ^~~~~~~~
  609. In file included from /usr/include/c++/8.3.0/memory:80,
  610.                  from /usr/include/c++/8.3.0/tr1/memory:39,
  611.                  from /run/build/opencolorio/_flatpak_build/export/OpenColorABI.h:63,
  612.                  from /run/build/opencolorio/export/OpenColorIO/OpenColorIO.h:38,
  613.                  from /run/build/opencolorio/src/core/OCIOYaml.cpp:31:
  614. /usr/include/c++/8.3.0/bits/unique_ptr.h:53:28: note: declared here
  615.    template<typename> class auto_ptr;
  616.                             ^~~~~~~~
  617. In file included from /run/build/opencolorio/_flatpak_build/ext/dist/include/yaml-cpp/node.h:14,
  618.                  from /run/build/opencolorio/_flatpak_build/ext/dist/include/yaml-cpp/yaml.h:13,
  619.                  from /run/build/opencolorio/src/core/OCIOYaml.cpp:75:
  620. /run/build/opencolorio/_flatpak_build/ext/dist/include/yaml-cpp/iterator.h:20:17: error: ‘template<class> class std::auto_ptr’ is deprecated [-Werror=deprecated-declarations]
  621.    Iterator(std::auto_ptr<IterPriv> pData);
  622.                  ^~~~~~~~
  623. In file included from /usr/include/c++/8.3.0/memory:80,
  624.                  from /usr/include/c++/8.3.0/tr1/memory:39,
  625.                  from /run/build/opencolorio/_flatpak_build/export/OpenColorABI.h:63,
  626.                  from /run/build/opencolorio/export/OpenColorIO/OpenColorIO.h:38,
  627.                  from /run/build/opencolorio/src/core/OCIOYaml.cpp:31:
  628. /usr/include/c++/8.3.0/bits/unique_ptr.h:53:28: note: declared here
  629.    template<typename> class auto_ptr;
  630.                             ^~~~~~~~
  631. In file included from /run/build/opencolorio/_flatpak_build/ext/dist/include/yaml-cpp/node.h:14,
  632.                  from /run/build/opencolorio/_flatpak_build/ext/dist/include/yaml-cpp/yaml.h:13,
  633.                  from /run/build/opencolorio/src/core/OCIOYaml.cpp:75:
  634. /run/build/opencolorio/_flatpak_build/ext/dist/include/yaml-cpp/iterator.h:36:8: error: ‘template<class> class std::auto_ptr’ is deprecated [-Werror=deprecated-declarations]
  635.    std::auto_ptr<IterPriv> m_pData;
  636.         ^~~~~~~~
  637. In file included from /usr/include/c++/8.3.0/memory:80,
  638.                  from /usr/include/c++/8.3.0/tr1/memory:39,
  639.                  from /run/build/opencolorio/_flatpak_build/export/OpenColorABI.h:63,
  640.                  from /run/build/opencolorio/export/OpenColorIO/OpenColorIO.h:38,
  641.                  from /run/build/opencolorio/src/core/OCIOYaml.cpp:31:
  642. /usr/include/c++/8.3.0/bits/unique_ptr.h:53:28: note: declared here
  643.    template<typename> class auto_ptr;
  644.                             ^~~~~~~~
  645. In file included from /run/build/opencolorio/_flatpak_build/ext/dist/include/yaml-cpp/yaml.h:13,
  646.                  from /run/build/opencolorio/src/core/OCIOYaml.cpp:75:
  647. /run/build/opencolorio/_flatpak_build/ext/dist/include/yaml-cpp/node.h:43:8: error: ‘template<class> class std::auto_ptr’ is deprecated [-Werror=deprecated-declarations]
  648.    std::auto_ptr<Node> Clone() const;
  649.         ^~~~~~~~
  650. In file included from /usr/include/c++/8.3.0/memory:80,
  651.                  from /usr/include/c++/8.3.0/tr1/memory:39,
  652.                  from /run/build/opencolorio/_flatpak_build/export/OpenColorABI.h:63,
  653.                  from /run/build/opencolorio/export/OpenColorIO/OpenColorIO.h:38,
  654.                  from /run/build/opencolorio/src/core/OCIOYaml.cpp:31:
  655. /usr/include/c++/8.3.0/bits/unique_ptr.h:53:28: note: declared here
  656.    template<typename> class auto_ptr;
  657.                             ^~~~~~~~
  658. In file included from /run/build/opencolorio/_flatpak_build/ext/dist/include/yaml-cpp/yaml.h:13,
  659.                  from /run/build/opencolorio/src/core/OCIOYaml.cpp:75:
  660. /run/build/opencolorio/_flatpak_build/ext/dist/include/yaml-cpp/node.h:117:8: error: ‘template<class> class std::auto_ptr’ is deprecated [-Werror=deprecated-declarations]
  661.    std::auto_ptr<NodeOwnership> m_pOwnership;
  662.         ^~~~~~~~
  663. In file included from /usr/include/c++/8.3.0/memory:80,
  664.                  from /usr/include/c++/8.3.0/tr1/memory:39,
  665.                  from /run/build/opencolorio/_flatpak_build/export/OpenColorABI.h:63,
  666.                  from /run/build/opencolorio/export/OpenColorIO/OpenColorIO.h:38,
  667.                  from /run/build/opencolorio/src/core/OCIOYaml.cpp:31:
  668. /usr/include/c++/8.3.0/bits/unique_ptr.h:53:28: note: declared here
  669.    template<typename> class auto_ptr;
  670.                             ^~~~~~~~
  671. cc1plus: all warnings being treated as errors
  672. make[2]: *** [src/core/CMakeFiles/OpenColorIO_STATIC.dir/build.make:687: src/core/CMakeFiles/OpenColorIO_STATIC.dir/OCIOYaml.cpp.o] Error 1
  673. make[2]: *** Waiting for unfinished jobs....
  674. [ 49%] Building CXX object src/core_tests/CMakeFiles/ocio_core_tests.dir/__/core/FileFormatIridasCube.cpp.o
  675. make[1]: *** [CMakeFiles/Makefile2:200: src/core/CMakeFiles/OpenColorIO_STATIC.dir/all] Error 2
  676. make[1]: *** Waiting for unfinished jobs....
  677. [ 50%] Building CXX object src/core_tests/CMakeFiles/ocio_core_tests.dir/__/core/FileFormatIridasItx.cpp.o
  678. [ 50%] Building CXX object src/core/CMakeFiles/OpenColorIO.dir/FileFormatPandora.cpp.o
  679. [ 50%] Building CXX object src/core_tests/CMakeFiles/ocio_core_tests.dir/__/core/FileFormatIridasLook.cpp.o
  680. [ 51%] Building CXX object src/core_tests/CMakeFiles/ocio_core_tests.dir/__/core/FileFormatPandora.cpp.o
  681. [ 51%] Building CXX object src/core_tests/CMakeFiles/ocio_core_tests.dir/__/core/FileFormatSpi1D.cpp.o
  682. [ 52%] Building CXX object src/core/CMakeFiles/OpenColorIO.dir/FileFormatSpi1D.cpp.o
  683. [ 53%] Building CXX object src/core_tests/CMakeFiles/ocio_core_tests.dir/__/core/FileFormatSpi3D.cpp.o
  684. [ 53%] Building CXX object src/core_tests/CMakeFiles/ocio_core_tests.dir/__/core/FileFormatSpiMtx.cpp.o
  685. [ 53%] Building CXX object src/core/CMakeFiles/OpenColorIO.dir/FileFormatSpi3D.cpp.o
  686. [ 53%] Building CXX object src/core_tests/CMakeFiles/ocio_core_tests.dir/__/core/FileFormatTruelight.cpp.o
  687. [ 54%] Building CXX object src/core_tests/CMakeFiles/ocio_core_tests.dir/__/core/FileFormatVF.cpp.o
  688. [ 54%] Building CXX object src/core_tests/CMakeFiles/ocio_core_tests.dir/__/core/FileTransform.cpp.o
  689. [ 55%] Building CXX object src/core/CMakeFiles/OpenColorIO.dir/FileFormatSpiMtx.cpp.o
  690. [ 56%] Building CXX object src/core_tests/CMakeFiles/ocio_core_tests.dir/__/core/GpuShaderDesc.cpp.o
  691. [ 56%] Building CXX object src/core/CMakeFiles/OpenColorIO.dir/FileFormatTruelight.cpp.o
  692. [ 56%] Building CXX object src/core_tests/CMakeFiles/ocio_core_tests.dir/__/core/GpuShaderUtils.cpp.o
  693. [ 57%] Building CXX object src/core_tests/CMakeFiles/ocio_core_tests.dir/__/core/GroupTransform.cpp.o
  694. [ 57%] Building CXX object src/core_tests/CMakeFiles/ocio_core_tests.dir/__/core/HashUtils.cpp.o
  695. [ 57%] Building CXX object src/core_tests/CMakeFiles/ocio_core_tests.dir/__/core/ImageDesc.cpp.o
  696. [ 58%] Building CXX object src/core_tests/CMakeFiles/ocio_core_tests.dir/__/core/ImagePacking.cpp.o
  697. [ 58%] Building CXX object src/core_tests/CMakeFiles/ocio_core_tests.dir/__/core/LogOps.cpp.o
  698. [ 59%] Building CXX object src/core_tests/CMakeFiles/ocio_core_tests.dir/__/core/LogTransform.cpp.o
  699. [ 59%] Building CXX object src/core_tests/CMakeFiles/ocio_core_tests.dir/__/core/Logging.cpp.o
  700. [ 60%] Building CXX object src/core_tests/CMakeFiles/ocio_core_tests.dir/__/core/Look.cpp.o
  701. [ 60%] Building CXX object src/core_tests/CMakeFiles/ocio_core_tests.dir/__/core/LookParse.cpp.o
  702. [ 60%] Building CXX object src/core/CMakeFiles/OpenColorIO.dir/FileFormatVF.cpp.o
  703. [ 61%] Building CXX object src/core_tests/CMakeFiles/ocio_core_tests.dir/__/core/LookTransform.cpp.o
  704. [ 61%] Building CXX object src/core_tests/CMakeFiles/ocio_core_tests.dir/__/core/Lut1DOp.cpp.o
  705. [ 62%] Building CXX object src/core/CMakeFiles/OpenColorIO.dir/FileTransform.cpp.o
  706. [ 62%] Building CXX object src/core_tests/CMakeFiles/ocio_core_tests.dir/__/core/Lut3DOp.cpp.o
  707. [ 63%] Building CXX object src/core_tests/CMakeFiles/ocio_core_tests.dir/__/core/MathUtils.cpp.o
  708. [ 63%] Building CXX object src/core_tests/CMakeFiles/ocio_core_tests.dir/__/core/MatrixOps.cpp.o
  709. [ 64%] Building CXX object src/core_tests/CMakeFiles/ocio_core_tests.dir/__/core/MatrixTransform.cpp.o
  710. [ 64%] Building CXX object src/core_tests/CMakeFiles/ocio_core_tests.dir/__/core/NoOps.cpp.o
  711. [ 64%] Building CXX object src/core/CMakeFiles/OpenColorIO.dir/GpuShaderDesc.cpp.o
  712. [ 65%] Building CXX object src/core/CMakeFiles/OpenColorIO.dir/GpuShaderUtils.cpp.o
  713. [ 66%] Building CXX object src/core_tests/CMakeFiles/ocio_core_tests.dir/__/core/OCIOYaml.cpp.o
  714. [ 66%] Building CXX object src/core_tests/CMakeFiles/ocio_core_tests.dir/__/core/Op.cpp.o
  715. [ 66%] Building CXX object src/core/CMakeFiles/OpenColorIO.dir/GroupTransform.cpp.o
  716. [ 66%] Building CXX object src/core_tests/CMakeFiles/ocio_core_tests.dir/__/core/OpOptimizers.cpp.o
  717. [ 67%] Building CXX object src/core/CMakeFiles/OpenColorIO.dir/HashUtils.cpp.o
  718. [ 67%] Building CXX object src/core/CMakeFiles/OpenColorIO.dir/ImageDesc.cpp.o
  719. [ 68%] Building CXX object src/core/CMakeFiles/OpenColorIO.dir/ImagePacking.cpp.o
  720. [ 69%] Building CXX object src/core_tests/CMakeFiles/ocio_core_tests.dir/__/core/ParseUtils.cpp.o
  721. [ 69%] Building CXX object src/core/CMakeFiles/OpenColorIO.dir/LogOps.cpp.o
  722. [ 69%] Building CXX object src/core/CMakeFiles/OpenColorIO.dir/LogTransform.cpp.o
  723. [ 70%] Building CXX object src/core/CMakeFiles/OpenColorIO.dir/Logging.cpp.o
  724. [ 70%] Building CXX object src/core/CMakeFiles/OpenColorIO.dir/Look.cpp.o
  725. [ 71%] Building CXX object src/core/CMakeFiles/OpenColorIO.dir/LookParse.cpp.o
  726. [ 71%] Building CXX object src/core_tests/CMakeFiles/ocio_core_tests.dir/__/core/PathUtils.cpp.o
  727. [ 71%] Building CXX object src/core/CMakeFiles/OpenColorIO.dir/LookTransform.cpp.o
  728. In file included from /run/build/opencolorio/_flatpak_build/ext/dist/include/yaml-cpp/yaml.h:8,
  729.                  from /run/build/opencolorio/src/core/OCIOYaml.cpp:75:
  730. /run/build/opencolorio/_flatpak_build/ext/dist/include/yaml-cpp/parser.h:46:8: warning: ‘template<class> class std::auto_ptr’ is deprecated [-Wdeprecated-declarations]
  731.    std::auto_ptr<Scanner> m_pScanner;
  732.         ^~~~~~~~
  733. In file included from /usr/include/c++/8.3.0/memory:80,
  734.                  from /usr/include/c++/8.3.0/tr1/memory:39,
  735.                  from /run/build/opencolorio/_flatpak_build/export/OpenColorABI.h:63,
  736.                  from /run/build/opencolorio/export/OpenColorIO/OpenColorIO.h:38,
  737.                  from /run/build/opencolorio/src/core/OCIOYaml.cpp:31:
  738. /usr/include/c++/8.3.0/bits/unique_ptr.h:53:28: note: declared here
  739.    template<typename> class auto_ptr;
  740.                             ^~~~~~~~
  741. In file included from /run/build/opencolorio/_flatpak_build/ext/dist/include/yaml-cpp/yaml.h:8,
  742.                  from /run/build/opencolorio/src/core/OCIOYaml.cpp:75:
  743. /run/build/opencolorio/_flatpak_build/ext/dist/include/yaml-cpp/parser.h:47:8: warning: ‘template<class> class std::auto_ptr’ is deprecated [-Wdeprecated-declarations]
  744.    std::auto_ptr<Directives> m_pDirectives;
  745.         ^~~~~~~~
  746. In file included from /usr/include/c++/8.3.0/memory:80,
  747.                  from /usr/include/c++/8.3.0/tr1/memory:39,
  748.                  from /run/build/opencolorio/_flatpak_build/export/OpenColorABI.h:63,
  749.                  from /run/build/opencolorio/export/OpenColorIO/OpenColorIO.h:38,
  750.                  from /run/build/opencolorio/src/core/OCIOYaml.cpp:31:
  751. /usr/include/c++/8.3.0/bits/unique_ptr.h:53:28: note: declared here
  752.    template<typename> class auto_ptr;
  753.                             ^~~~~~~~
  754. In file included from /run/build/opencolorio/_flatpak_build/ext/dist/include/yaml-cpp/yaml.h:9,
  755.                  from /run/build/opencolorio/src/core/OCIOYaml.cpp:75:
  756. /run/build/opencolorio/_flatpak_build/ext/dist/include/yaml-cpp/emitter.h:105:8: warning: ‘template<class> class std::auto_ptr’ is deprecated [-Wdeprecated-declarations]
  757.    std::auto_ptr <EmitterState> m_pState;
  758.         ^~~~~~~~
  759. In file included from /usr/include/c++/8.3.0/memory:80,
  760.                  from /usr/include/c++/8.3.0/tr1/memory:39,
  761.                  from /run/build/opencolorio/_flatpak_build/export/OpenColorABI.h:63,
  762.                  from /run/build/opencolorio/export/OpenColorIO/OpenColorIO.h:38,
  763.                  from /run/build/opencolorio/src/core/OCIOYaml.cpp:31:
  764. /usr/include/c++/8.3.0/bits/unique_ptr.h:53:28: note: declared here
  765.    template<typename> class auto_ptr;
  766.                             ^~~~~~~~
  767. In file included from /run/build/opencolorio/_flatpak_build/ext/dist/include/yaml-cpp/node.h:14,
  768.                  from /run/build/opencolorio/_flatpak_build/ext/dist/include/yaml-cpp/yaml.h:13,
  769.                  from /run/build/opencolorio/src/core/OCIOYaml.cpp:75:
  770. /run/build/opencolorio/_flatpak_build/ext/dist/include/yaml-cpp/iterator.h:20:17: warning: ‘template<class> class std::auto_ptr’ is deprecated [-Wdeprecated-declarations]
  771.    Iterator(std::auto_ptr<IterPriv> pData);
  772.                  ^~~~~~~~
  773. In file included from /usr/include/c++/8.3.0/memory:80,
  774.                  from /usr/include/c++/8.3.0/tr1/memory:39,
  775.                  from /run/build/opencolorio/_flatpak_build/export/OpenColorABI.h:63,
  776.                  from /run/build/opencolorio/export/OpenColorIO/OpenColorIO.h:38,
  777.                  from /run/build/opencolorio/src/core/OCIOYaml.cpp:31:
  778. /usr/include/c++/8.3.0/bits/unique_ptr.h:53:28: note: declared here
  779.    template<typename> class auto_ptr;
  780.                             ^~~~~~~~
  781. In file included from /run/build/opencolorio/_flatpak_build/ext/dist/include/yaml-cpp/node.h:14,
  782.                  from /run/build/opencolorio/_flatpak_build/ext/dist/include/yaml-cpp/yaml.h:13,
  783.                  from /run/build/opencolorio/src/core/OCIOYaml.cpp:75:
  784. /run/build/opencolorio/_flatpak_build/ext/dist/include/yaml-cpp/iterator.h:36:8: warning: ‘template<class> class std::auto_ptr’ is deprecated [-Wdeprecated-declarations]
  785.    std::auto_ptr<IterPriv> m_pData;
  786.         ^~~~~~~~
  787. In file included from /usr/include/c++/8.3.0/memory:80,
  788.                  from /usr/include/c++/8.3.0/tr1/memory:39,
  789.                  from /run/build/opencolorio/_flatpak_build/export/OpenColorABI.h:63,
  790.                  from /run/build/opencolorio/export/OpenColorIO/OpenColorIO.h:38,
  791.                  from /run/build/opencolorio/src/core/OCIOYaml.cpp:31:
  792. /usr/include/c++/8.3.0/bits/unique_ptr.h:53:28: note: declared here
  793.    template<typename> class auto_ptr;
  794.                             ^~~~~~~~
  795. In file included from /run/build/opencolorio/_flatpak_build/ext/dist/include/yaml-cpp/yaml.h:13,
  796.                  from /run/build/opencolorio/src/core/OCIOYaml.cpp:75:
  797. /run/build/opencolorio/_flatpak_build/ext/dist/include/yaml-cpp/node.h:43:8: warning: ‘template<class> class std::auto_ptr’ is deprecated [-Wdeprecated-declarations]
  798.    std::auto_ptr<Node> Clone() const;
  799.         ^~~~~~~~
  800. In file included from /usr/include/c++/8.3.0/memory:80,
  801.                  from /usr/include/c++/8.3.0/tr1/memory:39,
  802.                  from /run/build/opencolorio/_flatpak_build/export/OpenColorABI.h:63,
  803.                  from /run/build/opencolorio/export/OpenColorIO/OpenColorIO.h:38,
  804.                  from /run/build/opencolorio/src/core/OCIOYaml.cpp:31:
  805. /usr/include/c++/8.3.0/bits/unique_ptr.h:53:28: note: declared here
  806.    template<typename> class auto_ptr;
  807.                             ^~~~~~~~
  808. In file included from /run/build/opencolorio/_flatpak_build/ext/dist/include/yaml-cpp/yaml.h:13,
  809.                  from /run/build/opencolorio/src/core/OCIOYaml.cpp:75:
  810. /run/build/opencolorio/_flatpak_build/ext/dist/include/yaml-cpp/node.h:117:8: warning: ‘template<class> class std::auto_ptr’ is deprecated [-Wdeprecated-declarations]
  811.    std::auto_ptr<NodeOwnership> m_pOwnership;
  812.         ^~~~~~~~
  813. In file included from /usr/include/c++/8.3.0/memory:80,
  814.                  from /usr/include/c++/8.3.0/tr1/memory:39,
  815.                  from /run/build/opencolorio/_flatpak_build/export/OpenColorABI.h:63,
  816.                  from /run/build/opencolorio/export/OpenColorIO/OpenColorIO.h:38,
  817.                  from /run/build/opencolorio/src/core/OCIOYaml.cpp:31:
  818. /usr/include/c++/8.3.0/bits/unique_ptr.h:53:28: note: declared here
  819.    template<typename> class auto_ptr;
  820.                             ^~~~~~~~
  821. [ 72%] Building CXX object src/core/CMakeFiles/OpenColorIO.dir/Lut1DOp.cpp.o
  822. [ 72%] Building CXX object src/core/CMakeFiles/OpenColorIO.dir/Lut3DOp.cpp.o
  823. [ 72%] Building CXX object src/core/CMakeFiles/OpenColorIO.dir/MathUtils.cpp.o
  824. [ 73%] Building CXX object src/core/CMakeFiles/OpenColorIO.dir/MatrixOps.cpp.o
  825. [ 74%] Building CXX object src/core_tests/CMakeFiles/ocio_core_tests.dir/__/core/Platform.cpp.o
  826. [ 74%] Building CXX object src/core/CMakeFiles/OpenColorIO.dir/MatrixTransform.cpp.o
  827. [ 75%] Building CXX object src/core/CMakeFiles/OpenColorIO.dir/NoOps.cpp.o
  828. [ 75%] Building CXX object src/core_tests/CMakeFiles/ocio_core_tests.dir/__/core/Processor.cpp.o
  829. [ 75%] Building CXX object src/core/CMakeFiles/OpenColorIO.dir/OCIOYaml.cpp.o
  830. [ 76%] Building CXX object src/core/CMakeFiles/OpenColorIO.dir/Op.cpp.o
  831. [ 76%] Building CXX object src/core/CMakeFiles/OpenColorIO.dir/OpOptimizers.cpp.o
  832. [ 76%] Building CXX object src/core/CMakeFiles/OpenColorIO.dir/ParseUtils.cpp.o
  833. [ 77%] Building CXX object src/core_tests/CMakeFiles/ocio_core_tests.dir/__/core/ScanlineHelper.cpp.o
  834. [ 78%] Building CXX object src/core/CMakeFiles/OpenColorIO.dir/PathUtils.cpp.o
  835. [ 78%] Building CXX object src/core_tests/CMakeFiles/ocio_core_tests.dir/__/core/Transform.cpp.o
  836. [ 78%] Building CXX object src/core/CMakeFiles/OpenColorIO.dir/Platform.cpp.o
  837. [ 78%] Building CXX object src/core_tests/CMakeFiles/ocio_core_tests.dir/__/core/TruelightOp.cpp.o
  838. [ 79%] Building CXX object src/core/CMakeFiles/OpenColorIO.dir/Processor.cpp.o
  839. [ 79%] Building CXX object src/core/CMakeFiles/OpenColorIO.dir/ScanlineHelper.cpp.o
  840. [ 80%] Building CXX object src/core_tests/CMakeFiles/ocio_core_tests.dir/__/core/TruelightTransform.cpp.o
  841. [ 81%] Building CXX object src/core/CMakeFiles/OpenColorIO.dir/Transform.cpp.o
  842. In file included from /run/build/opencolorio/_flatpak_build/ext/dist/include/yaml-cpp/yaml.h:8,
  843.                  from /run/build/opencolorio/src/core/OCIOYaml.cpp:75:
  844. /run/build/opencolorio/_flatpak_build/ext/dist/include/yaml-cpp/parser.h:46:8: error: ‘template<class> class std::auto_ptr’ is deprecated [-Werror=deprecated-declarations]
  845.    std::auto_ptr<Scanner> m_pScanner;
  846.         ^~~~~~~~
  847. In file included from /usr/include/c++/8.3.0/memory:80,
  848.                  from /usr/include/c++/8.3.0/tr1/memory:39,
  849.                  from /run/build/opencolorio/_flatpak_build/export/OpenColorABI.h:63,
  850.                  from /run/build/opencolorio/export/OpenColorIO/OpenColorIO.h:38,
  851.                  from /run/build/opencolorio/src/core/OCIOYaml.cpp:31:
  852. /usr/include/c++/8.3.0/bits/unique_ptr.h:53:28: note: declared here
  853.    template<typename> class auto_ptr;
  854.                             ^~~~~~~~
  855. In file included from /run/build/opencolorio/_flatpak_build/ext/dist/include/yaml-cpp/yaml.h:8,
  856.                  from /run/build/opencolorio/src/core/OCIOYaml.cpp:75:
  857. /run/build/opencolorio/_flatpak_build/ext/dist/include/yaml-cpp/parser.h:47:8: error: ‘template<class> class std::auto_ptr’ is deprecated [-Werror=deprecated-declarations]
  858.    std::auto_ptr<Directives> m_pDirectives;
  859.         ^~~~~~~~
  860. In file included from /usr/include/c++/8.3.0/memory:80,
  861.                  from /usr/include/c++/8.3.0/tr1/memory:39,
  862.                  from /run/build/opencolorio/_flatpak_build/export/OpenColorABI.h:63,
  863.                  from /run/build/opencolorio/export/OpenColorIO/OpenColorIO.h:38,
  864.                  from /run/build/opencolorio/src/core/OCIOYaml.cpp:31:
  865. /usr/include/c++/8.3.0/bits/unique_ptr.h:53:28: note: declared here
  866.    template<typename> class auto_ptr;
  867.                             ^~~~~~~~
  868. In file included from /run/build/opencolorio/_flatpak_build/ext/dist/include/yaml-cpp/yaml.h:9,
  869.                  from /run/build/opencolorio/src/core/OCIOYaml.cpp:75:
  870. /run/build/opencolorio/_flatpak_build/ext/dist/include/yaml-cpp/emitter.h:105:8: error: ‘template<class> class std::auto_ptr’ is deprecated [-Werror=deprecated-declarations]
  871.    std::auto_ptr <EmitterState> m_pState;
  872.         ^~~~~~~~
  873. In file included from /usr/include/c++/8.3.0/memory:80,
  874.                  from /usr/include/c++/8.3.0/tr1/memory:39,
  875.                  from /run/build/opencolorio/_flatpak_build/export/OpenColorABI.h:63,
  876.                  from /run/build/opencolorio/export/OpenColorIO/OpenColorIO.h:38,
  877.                  from /run/build/opencolorio/src/core/OCIOYaml.cpp:31:
  878. /usr/include/c++/8.3.0/bits/unique_ptr.h:53:28: note: declared here
  879.    template<typename> class auto_ptr;
  880.                             ^~~~~~~~
  881. In file included from /run/build/opencolorio/_flatpak_build/ext/dist/include/yaml-cpp/node.h:14,
  882.                  from /run/build/opencolorio/_flatpak_build/ext/dist/include/yaml-cpp/yaml.h:13,
  883.                  from /run/build/opencolorio/src/core/OCIOYaml.cpp:75:
  884. /run/build/opencolorio/_flatpak_build/ext/dist/include/yaml-cpp/iterator.h:20:17: error: ‘template<class> class std::auto_ptr’ is deprecated [-Werror=deprecated-declarations]
  885.    Iterator(std::auto_ptr<IterPriv> pData);
  886.                  ^~~~~~~~
  887. In file included from /usr/include/c++/8.3.0/memory:80,
  888.                  from /usr/include/c++/8.3.0/tr1/memory:39,
  889.                  from /run/build/opencolorio/_flatpak_build/export/OpenColorABI.h:63,
  890.                  from /run/build/opencolorio/export/OpenColorIO/OpenColorIO.h:38,
  891.                  from /run/build/opencolorio/src/core/OCIOYaml.cpp:31:
  892. /usr/include/c++/8.3.0/bits/unique_ptr.h:53:28: note: declared here
  893.    template<typename> class auto_ptr;
  894.                             ^~~~~~~~
  895. In file included from /run/build/opencolorio/_flatpak_build/ext/dist/include/yaml-cpp/node.h:14,
  896.                  from /run/build/opencolorio/_flatpak_build/ext/dist/include/yaml-cpp/yaml.h:13,
  897.                  from /run/build/opencolorio/src/core/OCIOYaml.cpp:75:
  898. /run/build/opencolorio/_flatpak_build/ext/dist/include/yaml-cpp/iterator.h:36:8: error: ‘template<class> class std::auto_ptr’ is deprecated [-Werror=deprecated-declarations]
  899.    std::auto_ptr<IterPriv> m_pData;
  900.         ^~~~~~~~
  901. In file included from /usr/include/c++/8.3.0/memory:80,
  902.                  from /usr/include/c++/8.3.0/tr1/memory:39,
  903.                  from /run/build/opencolorio/_flatpak_build/export/OpenColorABI.h:63,
  904.                  from /run/build/opencolorio/export/OpenColorIO/OpenColorIO.h:38,
  905.                  from /run/build/opencolorio/src/core/OCIOYaml.cpp:31:
  906. /usr/include/c++/8.3.0/bits/unique_ptr.h:53:28: note: declared here
  907.    template<typename> class auto_ptr;
  908.                             ^~~~~~~~
  909. In file included from /run/build/opencolorio/_flatpak_build/ext/dist/include/yaml-cpp/yaml.h:13,
  910.                  from /run/build/opencolorio/src/core/OCIOYaml.cpp:75:
  911. /run/build/opencolorio/_flatpak_build/ext/dist/include/yaml-cpp/node.h:43:8: error: ‘template<class> class std::auto_ptr’ is deprecated [-Werror=deprecated-declarations]
  912.    std::auto_ptr<Node> Clone() const;
  913.         ^~~~~~~~
  914. In file included from /usr/include/c++/8.3.0/memory:80,
  915.                  from /usr/include/c++/8.3.0/tr1/memory:39,
  916.                  from /run/build/opencolorio/_flatpak_build/export/OpenColorABI.h:63,
  917.                  from /run/build/opencolorio/export/OpenColorIO/OpenColorIO.h:38,
  918.                  from /run/build/opencolorio/src/core/OCIOYaml.cpp:31:
  919. /usr/include/c++/8.3.0/bits/unique_ptr.h:53:28: note: declared here
  920.    template<typename> class auto_ptr;
  921.                             ^~~~~~~~
  922. In file included from /run/build/opencolorio/_flatpak_build/ext/dist/include/yaml-cpp/yaml.h:13,
  923.                  from /run/build/opencolorio/src/core/OCIOYaml.cpp:75:
  924. /run/build/opencolorio/_flatpak_build/ext/dist/include/yaml-cpp/node.h:117:8: error: ‘template<class> class std::auto_ptr’ is deprecated [-Werror=deprecated-declarations]
  925.    std::auto_ptr<NodeOwnership> m_pOwnership;
  926.         ^~~~~~~~
  927. In file included from /usr/include/c++/8.3.0/memory:80,
  928.                  from /usr/include/c++/8.3.0/tr1/memory:39,
  929.                  from /run/build/opencolorio/_flatpak_build/export/OpenColorABI.h:63,
  930.                  from /run/build/opencolorio/export/OpenColorIO/OpenColorIO.h:38,
  931.                  from /run/build/opencolorio/src/core/OCIOYaml.cpp:31:
  932. /usr/include/c++/8.3.0/bits/unique_ptr.h:53:28: note: declared here
  933.    template<typename> class auto_ptr;
  934.                             ^~~~~~~~
  935. cc1plus: all warnings being treated as errors
  936. make[2]: *** [src/core/CMakeFiles/OpenColorIO.dir/build.make:687: src/core/CMakeFiles/OpenColorIO.dir/OCIOYaml.cpp.o] Error 1
  937. make[2]: *** Waiting for unfinished jobs....
  938. [ 81%] Building CXX object src/core_tests/CMakeFiles/ocio_core_tests.dir/__/core/UnitTest.cpp.o
  939. [ 82%] Building CXX object src/core_tests/CMakeFiles/ocio_core_tests.dir/__/core/md5/md5.cpp.o
  940. make[1]: *** [CMakeFiles/Makefile2:238: src/core/CMakeFiles/OpenColorIO.dir/all] Error 2
  941. [ 82%] Building CXX object src/core_tests/CMakeFiles/ocio_core_tests.dir/__/core/pystring/pystring.cpp.o
  942. [ 83%] Linking CXX executable ocio_core_tests
  943. [ 83%] Built target ocio_core_tests
  944. make: *** [Makefile:163: all] Error 2
  945. Error: module opencolorio: Child process exited with code 2