Loading

jonathankang

  1. CC       gsd_test_datetime-gsd-timezone-monitor.o
  2. LC_ALL=C /usr/bin/intltool-merge -d -u -c ../../po/.intltool-merge-cache ../../po datetime.gnome-settings-plugin.in datetime.gnome-settings-plugin
  3. Found cached translation database
  4. Merging translations into datetime.gnome-settings-plugin.
  5. gsd-timezone-monitor.c:46:9: error: unknown type name ‘GClueClient’
  6.          GClueClient *geoclue_client;
  7.          ^
  8. gsd-timezone-monitor.c:47:9: error: unknown type name ‘GClueSimple’
  9.          GClueSimple *geoclue_simple;
  10.          ^
  11. gsd-timezone-monitor.c:269:21: error: unknown type name ‘GClueSimple’
  12.  on_location_notify (GClueSimple *simple,
  13.                      ^
  14. gsd-timezone-monitor.c: In function ‘on_geoclue_simple_ready’:
  15. gsd-timezone-monitor.c:292:9: error: unknown type name ‘GClueSimple’
  16.          GClueSimple *geoclue_simple;
  17.          ^
  18. gsd-timezone-monitor.c:294:26: warning: implicit declaration of function ‘gclue_simple_new_finish’ [-Wimplicit-function-declaration]
  19.          geoclue_simple = gclue_simple_new_finish (res, &error);
  20.                           ^
  21. gsd-timezone-monitor.c:294:9: warning: nested extern declaration of ‘gclue_simple_new_finish’ [-Wnested-externs]
  22.          geoclue_simple = gclue_simple_new_finish (res, &error);
  23.          ^
  24. gsd-timezone-monitor.c:294:24: warning: assignment makes pointer from integer without a cast [-Wint-conversion]
  25.          geoclue_simple = gclue_simple_new_finish (res, &error);
  26.                         ^
  27. gsd-timezone-monitor.c:304:32: warning: implicit declaration of function ‘gclue_simple_get_client’ [-Wimplicit-function-declaration]
  28.          priv->geoclue_client = gclue_simple_get_client (priv->geoclue_simple);
  29.                                 ^
  30. gsd-timezone-monitor.c:304:9: warning: nested extern declaration of ‘gclue_simple_get_client’ [-Wnested-externs]
  31.          priv->geoclue_client = gclue_simple_get_client (priv->geoclue_simple);
  32.          ^
  33. gsd-timezone-monitor.c:304:30: warning: assignment makes pointer from integer without a cast [-Wint-conversion]
  34.          priv->geoclue_client = gclue_simple_get_client (priv->geoclue_simple);
  35.                               ^
  36. gsd-timezone-monitor.c:305:9: warning: implicit declaration of function ‘gclue_client_set_distance_threshold’ [-Wimplicit-function-declaration]
  37.          gclue_client_set_distance_threshold (priv->geoclue_client,
  38.          ^
  39. gsd-timezone-monitor.c:305:9: warning: nested extern declaration of ‘gclue_client_set_distance_threshold’ [-Wnested-externs]
  40. gsd-timezone-monitor.c:308:93: error: ‘on_location_notify’ undeclared (first use in this function)
  41. gsd-timezone-monitor.c:308:93: note: each undeclared identifier is reported only once for each function it appears in
  42. gsd-timezone-monitor.c:311:9: warning: implicit declaration of function ‘on_location_notify’ [-Wimplicit-function-declaration]
  43.          on_location_notify (priv->geoclue_simple, NULL, user_data);
  44.          ^
  45. gsd-timezone-monitor.c: In function ‘register_geoclue’:
  46. gsd-timezone-monitor.c:319:9: warning: implicit declaration of function ‘gclue_simple_new’ [-Wimplicit-function-declaration]
  47.          gclue_simple_new (DESKTOP_ID,
  48.          ^
  49. gsd-timezone-monitor.c:319:9: warning: nested extern declaration of ‘gclue_simple_new’ [-Wnested-externs]
  50. gsd-timezone-monitor.c:320:27: error: ‘GCLUE_ACCURACY_LEVEL_CITY’ undeclared (first use in this function)
  51.                            GCLUE_ACCURACY_LEVEL_CITY,
  52.                            ^
  53. gsd-timezone-monitor.c: In function ‘gsd_timezone_monitor_finalize’:
  54. gsd-timezone-monitor.c:347:17: warning: implicit declaration of function ‘gclue_client_call_stop’ [-Wimplicit-function-declaration]
  55.                  gclue_client_call_stop (priv->geoclue_client, NULL, NULL, NULL);
  56.                  ^
  57. gsd-timezone-monitor.c:347:17: warning: nested extern declaration of ‘gclue_client_call_stop’ [-Wnested-externs]
  58. gsd-timezone-monitor.c: At top level:
  59. gsd-timezone-monitor.c:246:1: warning: ‘start_reverse_geocoding’ defined but not used [-Wunused-function]
  60.  start_reverse_geocoding (GsdTimezoneMonitor *self,
  61.  ^
  62. Makefile:785: recipe for target 'gsd_test_datetime-gsd-timezone-monitor.o' failed
  63. make[4]: *** [gsd_test_datetime-gsd-timezone-monitor.o] Error 1
  64. make[4]: *** Waiting for unfinished jobs....
  65. gsd-timezone-monitor.c:46:9: error: unknown type name ‘GClueClient’
  66.          GClueClient *geoclue_client;
  67.          ^
  68. gsd-timezone-monitor.c:47:9: error: unknown type name ‘GClueSimple’
  69.          GClueSimple *geoclue_simple;
  70.          ^
  71. gsd-timezone-monitor.c:269:21: error: unknown type name ‘GClueSimple’
  72.  on_location_notify (GClueSimple *simple,
  73.                      ^
  74. gsd-timezone-monitor.c: In function ‘on_geoclue_simple_ready’:
  75. gsd-timezone-monitor.c:292:9: error: unknown type name ‘GClueSimple’
  76.          GClueSimple *geoclue_simple;
  77.          ^
  78. gsd-timezone-monitor.c:294:26: warning: implicit declaration of function ‘gclue_simple_new_finish’ [-Wimplicit-function-declaration]
  79.          geoclue_simple = gclue_simple_new_finish (res, &error);
  80.                           ^
  81. gsd-timezone-monitor.c:294:9: warning: nested extern declaration of ‘gclue_simple_new_finish’ [-Wnested-externs]
  82.          geoclue_simple = gclue_simple_new_finish (res, &error);
  83.          ^
  84. gsd-timezone-monitor.c:294:24: warning: assignment makes pointer from integer without a cast [-Wint-conversion]
  85.          geoclue_simple = gclue_simple_new_finish (res, &error);
  86.                         ^
  87. gsd-timezone-monitor.c:304:32: warning: implicit declaration of function ‘gclue_simple_get_client’ [-Wimplicit-function-declaration]
  88.          priv->geoclue_client = gclue_simple_get_client (priv->geoclue_simple);
  89.                                 ^
  90. gsd-timezone-monitor.c:304:9: warning: nested extern declaration of ‘gclue_simple_get_client’ [-Wnested-externs]
  91.          priv->geoclue_client = gclue_simple_get_client (priv->geoclue_simple);
  92.          ^
  93. gsd-timezone-monitor.c:304:30: warning: assignment makes pointer from integer without a cast [-Wint-conversion]
  94.          priv->geoclue_client = gclue_simple_get_client (priv->geoclue_simple);
  95.                               ^
  96. gsd-timezone-monitor.c:305:9: warning: implicit declaration of function ‘gclue_client_set_distance_threshold’ [-Wimplicit-function-declaration]
  97.          gclue_client_set_distance_threshold (priv->geoclue_client,
  98.          ^
  99. gsd-timezone-monitor.c:305:9: warning: nested extern declaration of ‘gclue_client_set_distance_threshold’ [-Wnested-externs]
  100. gsd-timezone-monitor.c:308:93: error: ‘on_location_notify’ undeclared (first use in this function)
  101. gsd-timezone-monitor.c:308:93: note: each undeclared identifier is reported only once for each function it appears in
  102. gsd-timezone-monitor.c:311:9: warning: implicit declaration of function ‘on_location_notify’ [-Wimplicit-function-declaration]
  103.          on_location_notify (priv->geoclue_simple, NULL, user_data);
  104.          ^
  105. gsd-timezone-monitor.c: In function ‘register_geoclue’:
  106. gsd-timezone-monitor.c:319:9: warning: implicit declaration of function ‘gclue_simple_new’ [-Wimplicit-function-declaration]
  107.          gclue_simple_new (DESKTOP_ID,
  108.          ^
  109. gsd-timezone-monitor.c:319:9: warning: nested extern declaration of ‘gclue_simple_new’ [-Wnested-externs]
  110. gsd-timezone-monitor.c:320:27: error: ‘GCLUE_ACCURACY_LEVEL_CITY’ undeclared (first use in this function)
  111.                            GCLUE_ACCURACY_LEVEL_CITY,
  112.                            ^
  113. gsd-timezone-monitor.c: In function ‘gsd_timezone_monitor_finalize’:
  114. gsd-timezone-monitor.c:347:17: warning: implicit declaration of function ‘gclue_client_call_stop’ [-Wimplicit-function-declaration]
  115.                  gclue_client_call_stop (priv->geoclue_client, NULL, NULL, NULL);
  116.                  ^
  117. gsd-timezone-monitor.c:347:17: warning: nested extern declaration of ‘gclue_client_call_stop’ [-Wnested-externs]
  118. gsd-timezone-monitor.c: At top level:
  119. gsd-timezone-monitor.c:246:1: warning: ‘start_reverse_geocoding’ defined but not used [-Wunused-function]
  120.  start_reverse_geocoding (GsdTimezoneMonitor *self,
  121.  ^
  122. Makefile:736: recipe for target 'libdatetime_la-gsd-timezone-monitor.lo' failed
  123. make[4]: *** [libdatetime_la-gsd-timezone-monitor.lo] Error 1
  124. make[4]: Leaving directory '/home/jonathan/jhbuild/checkout/gnome-settings-daemon/plugins/datetime'
  125. Makefile:549: recipe for target 'all' failed
  126. make[3]: *** [all] Error 2
  127. make[3]: Leaving directory '/home/jonathan/jhbuild/checkout/gnome-settings-daemon/plugins/datetime'
  128. Makefile:472: recipe for target 'all-recursive' failed
  129. make[2]: *** [all-recursive] Error 1
  130. make[2]: Leaving directory '/home/jonathan/jhbuild/checkout/gnome-settings-daemon/plugins'
  131. Makefile:517: recipe for target 'all-recursive' failed
  132. make[1]: *** [all-recursive] Error 1
  133. make[1]: Leaving directory '/home/jonathan/jhbuild/checkout/gnome-settings-daemon'
  134. Makefile:449: recipe for target 'all' failed
  135. make: *** [all] Error 2
  136. *** Error during phase build of gnome-settings-daemon: ########## Error running make -j 5  *** [1/34]
  137.  
  138.   [1] Rerun phase build
  139.   [2] Ignore error and continue to install
  140.   [3] Give up on module
  141.   [4] Start shell
  142.   [5] Reload configuration
  143.   [6] Go to phase "wipe directory and start over"
  144.   [7] Go to phase "configure"
  145.   [8] Go to phase "clean"
  146.   [9] Go to phase "distclean"
  147. choice: ^CInterrupted