Loading

Paste #puer5j91r

  1. In file included from /usr/include/c++/8.3.0/memory:80,
  2.                  from /usr/include/c++/8.3.0/tr1/memory:39,
  3.                  from /run/build/opencolorio/_flatpak_build/export/OpenColorABI.h:63,
  4.                  from /run/build/opencolorio/export/OpenColorIO/OpenColorIO.h:38,
  5.                  from /run/build/opencolorio/src/core/OCIOYaml.cpp:31:
  6. /usr/include/c++/8.3.0/bits/unique_ptr.h:53:28: note: declared here
  7.    template<typename> class auto_ptr;
  8.                             ^~~~~~~~
  9. cc1plus: all warnings being treated as errors
  10. make[2]: *** [src/core/CMakeFiles/OpenColorIO.dir/build.make:687: src/core/CMakeFiles/OpenColorIO.dir/OCIOYaml.cpp.o] Error 1
  11. make[2]: *** Waiting for unfinished jobs....
  12. [ 81%] Building CXX object src/core_tests/CMakeFiles/ocio_core_tests.dir/__/core/UnitTest.cpp.o
  13. [ 82%] Building CXX object src/core_tests/CMakeFiles/ocio_core_tests.dir/__/core/md5/md5.cpp.o
  14. make[1]: *** [CMakeFiles/Makefile2:238: src/core/CMakeFiles/OpenColorIO.dir/all] Error 2
  15. [ 82%] Building CXX object src/core_tests/CMakeFiles/ocio_core_tests.dir/__/core/pystring/pystring.cpp.o
  16. [ 83%] Linking CXX executable ocio_core_tests
  17. [ 83%] Built target ocio_core_tests
  18. make: *** [Makefile:163: all] Error 2
  19. Error: module opencolorio: Child process exited with code 2