Loading

Paste #puvyfnytg

  1. *** Building gnome-shell *** [1/1]
  2. ninja  
  3. [124/146] Linking target src/gnome-shell-extension-prefs.
  4. FAILED: src/gnome-shell-extension-prefs
  5. ccache cc  -o src/gnome-shell-extension-prefs 'src/25a6634@@gnome-shell-extension-prefs@exe/meson-generated_.._.._js_prefs-resources.c.o' 'src/25a6634@@gnome-shell-extension-prefs@exe/gnome-shell-extension-prefs.c.o' -L/home/aday/jhbuild/install/lib -Wl,--no-undefined -Wl,--as-needed -Wl,--start-group /home/aday/jhbuild/install/lib/libgio-2.0.so /home/aday/jhbuild/install/lib/libgobject-2.0.so /home/aday/jhbuild/install/lib/libglib-2.0.so /home/aday/jhbuild/install/lib/libgjs.so -Wl,--end-group
  6. /usr/bin/ld: /home/aday/jhbuild/install/lib/libgjs.so: undefined reference to `std::__cxx11::basic_string<char, std::char_traits<char>, std::allocator<char> >::_M_assign(std::__cxx11::basic_string<char, std::char_traits<char>, std::allocator<char> > const&)@js'
  7. /usr/bin/ld: /home/aday/jhbuild/install/lib/libgjs.so: undefined reference to `std::__cxx11::basic_string<char, std::char_traits<char>, std::allocator<char> >::_M_create(unsigned long&, unsigned long)@js'
  8. /usr/bin/ld: /home/aday/jhbuild/install/lib/libgjs.so: undefined reference to `std::__cxx11::basic_string<char, std::char_traits<char>, std::allocator<char> >::_M_replace(unsigned long, unsigned long, char const*, unsigned long)@js'
  9. collect2: error: ld returned 1 exit status
  10. [125/146] Linking target src/gnome-shell-portal-helper.
  11. FAILED: src/gnome-shell-portal-helper
  12. ccache cc  -o src/gnome-shell-portal-helper 'src/25a6634@@gnome-shell-portal-helper@exe/meson-generated_.._.._js_portal-resources.c.o' 'src/25a6634@@gnome-shell-portal-helper@exe/gnome-shell-portal-helper.c.o' -L/home/aday/jhbuild/install/lib -Wl,--no-undefined -Wl,--as-needed -Wl,--start-group /home/aday/jhbuild/install/lib/libgio-2.0.so /home/aday/jhbuild/install/lib/libgobject-2.0.so /home/aday/jhbuild/install/lib/libglib-2.0.so /home/aday/jhbuild/install/lib/libgjs.so -Wl,--end-group
  13. /usr/bin/ld: /home/aday/jhbuild/install/lib/libgjs.so: undefined reference to `std::__cxx11::basic_string<char, std::char_traits<char>, std::allocator<char> >::_M_assign(std::__cxx11::basic_string<char, std::char_traits<char>, std::allocator<char> > const&)@js'
  14. /usr/bin/ld: /home/aday/jhbuild/install/lib/libgjs.so: undefined reference to `std::__cxx11::basic_string<char, std::char_traits<char>, std::allocator<char> >::_M_create(unsigned long&, unsigned long)@js'
  15. /usr/bin/ld: /home/aday/jhbuild/install/lib/libgjs.so: undefined reference to `std::__cxx11::basic_string<char, std::char_traits<char>, std::allocator<char> >::_M_replace(unsigned long, unsigned long, char const*, unsigned long)@js'
  16. collect2: error: ld returned 1 exit status
  17. [133/146] Compiling C object 'src/25a6634@@gnome-shell@sha/shell-recorder.c.o'.
  18. ninja: build stopped: subcommand failed.
  19. *** Error during phase build of gnome-shell: ########## Error running ninja   *** [1/1]